{"text_format":"1","workbook":"xlsx","n_sheets":13,"sheets":["OLD PAPI_24- 27 (Delib. 246) ","Identificação das ações 24-27","Acompanhamento das metas 24-27","Acomp. financeiro  24-27","PAPI 2024-2027","Consolidaçao - 1","Consolidaçao - 2","Orientações","Acomp. - PAPI_21 (Delib. 190) ","Acomp. PAPI_22_23 (Delib. 246) ","Operacional","Explicativo","de-para 246 190"],"not_rendered":{"charts":5,"images":0,"macros":1,"external_links":1,"defined_names":8,"comments":7,"pivot_tables":6},"unopened":[],"bounds":{"document_bytes":16777216,"sheet_cells":100000,"rows_first":2000,"rows_last":500,"rows_between":2000,"halvings":0,"cell_chars":16384,"cell_head_chars":4096},"cells_cut":0,"cells_raw":0,"read":"whole","date_system":"1900"}

{"sheet":"OLD PAPI_24- 27 (Delib. 246) ","index":0,"n_rows":50,"n_cols":24,"rows_kept":50,"cut":false,"hidden":true,"merged":[]}
["ID Ação","Ação iniciou no PA/PI anterior?","Se sim, id da ação anterior","Ano previsto para início","Tipo de ação","É ou será  empreendimento FEHIDRO?","Ação requer recursos financeiros?","SubPDC","Prioridade do SubPDC","Ação","Meta","% Execução da meta do quadriênio","Segmento do executor","Área de abrangência","Nome da área de abrangência","Recurso financeiro estimado no ano\n(R$) - Cobrança Estadual","Recurso financeiro estimado no ano (R$) - CFURH","Recurso financeiro estimado no ano\n(R$) - Cobrança Federal","Recurso financeiro estimado no ano (R$) - Outras","Especificar Fonte - \"Outras\"","Recurso financeiro estimado no ano\n(R$)","Recurso financeiro disponibilizado no ano (R$)","Recurso financeiro executado no ano (R$)","Justificativa sobre execução física e financeira"]
["SID012024","Não",null,2024,null,"Sim",null,"3.1 - Efluentes","Não prioritário","Efetuar estudos de detalhe sobre a disponibilidade hídrica superficial e subterrânea (AG.11)","MG.4 - Realizar ao menos 01 estudo que subsidie o planejamento e a gestão de recursos hídricos na UGRHi 18",null,null,"Sub-bacia","Sub-bacia crítica conforme classe de  vazão de referência apontadas no Relatório de Situação",null,null,null,null,null,{"$f":"IF(SUM(PAPI20_22_23[[#This Row],[Recurso financeiro estimado no ano\n(R$) - Cobrança Estadual]:[Recurso financeiro estimado no ano (R$) - Outras]]) >0,SUM(PAPI20_22_23[[#This Row],[Recurso financeiro estimado no ano\n(R$) - Cobrança Estadual]:[Recurso financeiro estimado no ano (R$) - Outras]]),\"\")","v":""}]
["SID012025",null,null,2024,null,null,null,null,null,"Manter o cadastro atualizado na bacia hidrográfica SJD  (AG.13)","MG.4 - Realizar ao menos 01 estudo para acompanhamento e adequação da cobrança pelo uso dos recursos hídricos",null,"Estado","UGRHi","UGRHi 18",170000,null,null,null,null,{"$f":"IF(SUM(PAPI20_22_23[[#This Row],[Recurso financeiro estimado no ano\n(R$) - Cobrança Estadual]:[Recurso financeiro estimado no ano (R$) - Outras]]) >0,SUM(PAPI20_22_23[[#This Row],[Recurso financeiro estimado no ano\n(R$) - Cobrança Estadual]:[Recurso financeiro estimado no ano (R$) - Outras]]),\"\")","v":170000}]
["SID012024",null,null,null,null,null,null,null,null,"Execução de obras de sistemas de esgotamento sanitário, bem como de tratamento de efluentes provenientes de ETE  (AI.3, 4, 5 e 6)","MI. 2 e 3 - Efetuar melhorias nos sistemas de tratamento de esgoto  em ao \nmenos 02 municípios",null,"Município","Município","Municípios da UGRHi 18 que apresentem proporção de redução da carga orgânica poluidora domestica ≤ 80%. ",260000,null,null,null,null,{"$f":"IF(SUM(PAPI20_22_23[[#This Row],[Recurso financeiro estimado no ano\n(R$) - Cobrança Estadual]:[Recurso financeiro estimado no ano (R$) - Outras]]) >0,SUM(PAPI20_22_23[[#This Row],[Recurso financeiro estimado no ano\n(R$) - Cobrança Estadual]:[Recurso financeiro estimado no ano (R$) - Outras]]),\"\")","v":260000}]
["SID042022",null,null,null,null,null,null,null,null,"Execução de obras e projetos (AI 8 e 9) nos casos em que haja comprometimento dos recursos hídricos","MI.4 -  Efetuar melhorias nos sistemas de aterros sanitários em ao menos 02  municípios",null,"Município","Município","Municípios com sistema de tratamento e coleta de resíduos sólidos ineficientes, conforme  consta no Rel. Situação.",250000,null,null,null,null,{"$f":"IF(SUM(PAPI20_22_23[[#This Row],[Recurso financeiro estimado no ano\n(R$) - Cobrança Estadual]:[Recurso financeiro estimado no ano (R$) - Outras]]) >0,SUM(PAPI20_22_23[[#This Row],[Recurso financeiro estimado no ano\n(R$) - Cobrança Estadual]:[Recurso financeiro estimado no ano (R$) - Outras]]),\"\")","v":250000}]
["SID052022",null,null,null,null,null,null,null,null,"Execução de obras ou projetos que controle a erosão do solo ou assoreamento dos corpos d’água, em áreas urbanas ou rurais (AI. 14, 15 e 16)","MI. 6 e MI. 7 - Aprimorar sistemas de conservação do solo e controle de erosão em ao menos 03 municípios",null,"Município","Município","Municípios com Plano de Drenagem ou Plano Diretor de Erosão elaborado",null,288866.7,null,null,null,{"$f":"IF(SUM(PAPI20_22_23[[#This Row],[Recurso financeiro estimado no ano\n(R$) - Cobrança Estadual]:[Recurso financeiro estimado no ano (R$) - Outras]]) >0,SUM(PAPI20_22_23[[#This Row],[Recurso financeiro estimado no ano\n(R$) - Cobrança Estadual]:[Recurso financeiro estimado no ano (R$) - Outras]]),\"\")","v":288866.7}]
["SID062022",null,null,null,null,null,null,null,null,"Implementação das açoes indicadas no Plano de Saneamento (AI.11 e 12)\n(troca de hidrômetros, manutenção de rede, instalação de válvulas redutoras de pressão, entre outros)","MI.5 - Reduzir perdas em sistemas de abastecimento de água em ao menos 02 municípios",null,"Município","Município","Ilha Solteira, Santa Fé do Sul, Suzanápolis, São João de Iracema e Neves Paulista",170000,null,null,null,null,{"$f":"IF(SUM(PAPI20_22_23[[#This Row],[Recurso financeiro estimado no ano\n(R$) - Cobrança Estadual]:[Recurso financeiro estimado no ano (R$) - Outras]]) >0,SUM(PAPI20_22_23[[#This Row],[Recurso financeiro estimado no ano\n(R$) - Cobrança Estadual]:[Recurso financeiro estimado no ano (R$) - Outras]]),\"\")","v":170000}]
["SID072022",null,null,null,null,null,null,null,null,"Execução de obras ou projetos de galerias de águas pluviais e canalização de curso d'água em área urbana e periurbana (AI.17, AI. 21, 22 e 23 )","MI. 7 e MI. 9 - Realizar melhorias nos sistemas de drenagem em ao menos 02 municípios",null,"Município","Município","Obras indicadas no Plano/Estudo de Drenagem no Município  e para Projetos com necessidades de readequação/ampliação",null,200000,null,null,null,{"$f":"IF(SUM(PAPI20_22_23[[#This Row],[Recurso financeiro estimado no ano\n(R$) - Cobrança Estadual]:[Recurso financeiro estimado no ano (R$) - Outras]]) >0,SUM(PAPI20_22_23[[#This Row],[Recurso financeiro estimado no ano\n(R$) - Cobrança Estadual]:[Recurso financeiro estimado no ano (R$) - Outras]]),\"\")","v":200000}]
["SID082022",null,null,null,null,null,null,null,null,"Orientação aos produtores rurais quanto à importância da outorga e treinamento/capacitação sobre os procedimentos de outorga e licenciamento ambiental (AG.25)","MG.9. Realizar ao menos 1 curso de capacitação técnica relacionada ao planejamento e gestão de recursos hídricos",null,null,"UGRHi","UGRHi 18",150000,null,null,null,null,{"$f":"IF(SUM(PAPI20_22_23[[#This Row],[Recurso financeiro estimado no ano\n(R$) - Cobrança Estadual]:[Recurso financeiro estimado no ano (R$) - Outras]]) >0,SUM(PAPI20_22_23[[#This Row],[Recurso financeiro estimado no ano\n(R$) - Cobrança Estadual]:[Recurso financeiro estimado no ano (R$) - Outras]]),\"\")","v":150000},150000,0,"empreendimento não iniciado - emitiu o contrato"]
["SID012023",null,null,null,null,null,null,null,null,"Realizar estudo/diagnóstico ambiental das nascentes, por sub-bacia, na UGRHI","Aumentar as informações afim de subsidiar o planejamento e a gestão dos recursos hídricos na UGRHI",null,"DIVERSOS","UGRHi","UGRHi 18 ",200197.43,null,null,null,null,{"$f":"IF(SUM(PAPI20_22_23[[#This Row],[Recurso financeiro estimado no ano\n(R$) - Cobrança Estadual]:[Recurso financeiro estimado no ano (R$) - Outras]]) >0,SUM(PAPI20_22_23[[#This Row],[Recurso financeiro estimado no ano\n(R$) - Cobrança Estadual]:[Recurso financeiro estimado no ano (R$) - Outras]]),\"\")","v":200197.43}]
["SID022023",null,null,null,null,null,null,null,null,"Elaborar mapa de feições erosivas da UGRHI"," Aumentar as informações afim de subsidiar o planejamento e a gestão dos recursos hídricos na UGRHI",null,"DIVERSOS","UGRHi","UGRHi 18 ",null,280000,null,null,null,{"$f":"IF(SUM(PAPI20_22_23[[#This Row],[Recurso financeiro estimado no ano\n(R$) - Cobrança Estadual]:[Recurso financeiro estimado no ano (R$) - Outras]]) >0,SUM(PAPI20_22_23[[#This Row],[Recurso financeiro estimado no ano\n(R$) - Cobrança Estadual]:[Recurso financeiro estimado no ano (R$) - Outras]]),\"\")","v":280000}]
["SID032022",null,null,null,null,null,null,null,null,"Elaboração do Plano diretor de controle de perdas","Aumentar as informações afim de subsidiar o planejamento e a gestão dos recursos hídricos na UGRHI",null,"Município","Município","Ilha Solteira, Neves Paulista, São João de Iracema e Santa Fé do Sul.",170000,null,null,null,null,{"$f":"IF(SUM(PAPI20_22_23[[#This Row],[Recurso financeiro estimado no ano\n(R$) - Cobrança Estadual]:[Recurso financeiro estimado no ano (R$) - Outras]]) >0,SUM(PAPI20_22_23[[#This Row],[Recurso financeiro estimado no ano\n(R$) - Cobrança Estadual]:[Recurso financeiro estimado no ano (R$) - Outras]]),\"\")","v":170000}]
["SID042023",null,null,null,null,null,null,null,null,"Elaborar estudos para o controle de processos erosivos e projetos (básicos e/ou executivos), serviços ou obras para prevenção, prioritariamente em bacias de abastecimento, nascentes e áreas de recarga\n(troca de hidrômetros, manutenção de rede, instalação de válvulas redutoras de pressão, entre outros)","Prevenir e controlar processos de erosão e assoreamento, visando a melhoria ou recuperação dos corpos d’água",null,"Município","Município","Floreal, General Salgado, Ilha Solteira, Jales, Monte Aprazível, Neves Paulista, Nhandeara, Palmeira d´oeste, Santa Fé do Sul, Sebastianópolis do Sul, Cosmorama, Monte Aprazível, Poloni, Santa Salete, Santana da Ponte Pensa, São Francisco, Tanabi, Três Fronteiras e Votuporanga",400000,300000,null,null,null,{"$f":"IF(SUM(PAPI20_22_23[[#This Row],[Recurso financeiro estimado no ano\n(R$) - Cobrança Estadual]:[Recurso financeiro estimado no ano (R$) - Outras]]) >0,SUM(PAPI20_22_23[[#This Row],[Recurso financeiro estimado no ano\n(R$) - Cobrança Estadual]:[Recurso financeiro estimado no ano (R$) - Outras]]),\"\")","v":700000}]
["SID052023",null,null,null,null,null,null,null,null,"Elaborar Projetos (básicos e/ou executivos), obras ou serviços em sistemas de abastecimento, visando controle e redução de perdas de água","Alcance de uma média de 25% de perdas globais nos municípios da Bacia",null,"Município","Município","Ilha Solteira, Suzanápolis, Santa Fé do Sul, Neves Paulista e São João de Iracema.",300000,null,null,null,null,{"$f":"IF(SUM(PAPI20_22_23[[#This Row],[Recurso financeiro estimado no ano\n(R$) - Cobrança Estadual]:[Recurso financeiro estimado no ano (R$) - Outras]]) >0,SUM(PAPI20_22_23[[#This Row],[Recurso financeiro estimado no ano\n(R$) - Cobrança Estadual]:[Recurso financeiro estimado no ano (R$) - Outras]]),\"\")","v":300000}]
["SID092023",null,null,null,null,null,null,null,null,"Aquisição de equipamentos para operacionalização  de sistemas de alerta, radares meteorológicos ou redes telemétricas integrados a sistemas de suporte à decisão; divulgação de informações e apoio à defesa civil (AG. 24) ","MG. 8 - Estruturar 01 Sala de Situação visando o Monitoramento de eventos extremos e sistemas de suporte a decisão",null,null,"Sub-bacia","UGRHi 18",400000,null,null,null,null,{"$f":"IF(SUM(PAPI20_22_23[[#This Row],[Recurso financeiro estimado no ano\n(R$) - Cobrança Estadual]:[Recurso financeiro estimado no ano (R$) - Outras]]) >0,SUM(PAPI20_22_23[[#This Row],[Recurso financeiro estimado no ano\n(R$) - Cobrança Estadual]:[Recurso financeiro estimado no ano (R$) - Outras]]),\"\")","v":400000},851322.1,0,"adiantamos a indicação da ação prevista para 2023 - empreendimento cancelado"]
["SID07023",null,null,null,null,null,null,null,null,"Elaborar projetos (básicos e/ou executivos), serviços, obras em municípios com sistema de coleta e disposição final de resíduos sólidos ineficientes e/ou inadequadas; e implantar pontos de entrega voluntária (PEV), e programas de coleta seletiva"," Aumentar a cobertura da coleta de resíduos sólidos em áreas urbanas e rurais dos municípios ",null,"Município","Município","Município",308323.15000000002,null,null,null,null,{"$f":"IF(SUM(PAPI20_22_23[[#This Row],[Recurso financeiro estimado no ano\n(R$) - Cobrança Estadual]:[Recurso financeiro estimado no ano (R$) - Outras]]) >0,SUM(PAPI20_22_23[[#This Row],[Recurso financeiro estimado no ano\n(R$) - Cobrança Estadual]:[Recurso financeiro estimado no ano (R$) - Outras]]),\"\")","v":308323.15000000002}]
["SID08023",null,null,null,null,null,null,null,null,"Elaborar projetos (básicos e/ou executivos), executar obras ou serviços em sistemas de abastecimento, visando propor soluções alternativas e a ampliação da rede de distribuição, das demais estruturas de apoio ao abastecimento","Aproveitamento dos recursos hídricos e segurança hídrica",null,"Município","Município","Município",179324.92,null,null,null,null,{"$f":"IF(SUM(PAPI20_22_23[[#This Row],[Recurso financeiro estimado no ano\n(R$) - Cobrança Estadual]:[Recurso financeiro estimado no ano (R$) - Outras]]) >0,SUM(PAPI20_22_23[[#This Row],[Recurso financeiro estimado no ano\n(R$) - Cobrança Estadual]:[Recurso financeiro estimado no ano (R$) - Outras]]),\"\")","v":179324.92}]
["SID06023",null,null,null,null,null,null,null,null,"Elaborar projetos (básicos e/ou executivos), serviços ou obras para contenção de inundações, alagamentos, inclusive por técnicas de infiltração e armazenamento; e regularizações de descargas e dispositivos de lançamento de drenagem"," Contenção de inundações, alagamentos e regularizações de descargas na UGRHI",null,"Município","Município","Município",null,1113141.6499999999,null,null,null,{"$f":"IF(SUM(PAPI20_22_23[[#This Row],[Recurso financeiro estimado no ano\n(R$) - Cobrança Estadual]:[Recurso financeiro estimado no ano (R$) - Outras]]) >0,SUM(PAPI20_22_23[[#This Row],[Recurso financeiro estimado no ano\n(R$) - Cobrança Estadual]:[Recurso financeiro estimado no ano (R$) - Outras]]),\"\")","v":1113141.6499999999}]
[null,null,null,null,null,null,null,null,null,null,null,null,null,null,null,null,null,null,null,null,{"$f":"IF(SUM(PAPI20_22_23[[#This Row],[Recurso financeiro estimado no ano\n(R$) - Cobrança Estadual]:[Recurso financeiro estimado no ano (R$) - Outras]]) >0,SUM(PAPI20_22_23[[#This Row],[Recurso financeiro estimado no ano\n(R$) - Cobrança Estadual]:[Recurso financeiro estimado no ano (R$) - Outras]]),\"\")","v":""}]
[null,null,null,null,null,null,null,null,null,null,null,null,null,null,null,null,null,null,null,null,{"$f":"IF(SUM(PAPI20_22_23[[#This Row],[Recurso financeiro estimado no ano\n(R$) - Cobrança Estadual]:[Recurso financeiro estimado no ano (R$) - Outras]]) >0,SUM(PAPI20_22_23[[#This Row],[Recurso financeiro estimado no ano\n(R$) - Cobrança Estadual]:[Recurso financeiro estimado no ano (R$) - Outras]]),\"\")","v":""}]
[null,null,null,null,null,null,null,null,null,null,null,null,null,null,null,null,null,null,null,null,{"$f":"IF(SUM(PAPI20_22_23[[#This Row],[Recurso financeiro estimado no ano\n(R$) - Cobrança Estadual]:[Recurso financeiro estimado no ano (R$) - Outras]]) >0,SUM(PAPI20_22_23[[#This Row],[Recurso financeiro estimado no ano\n(R$) - Cobrança Estadual]:[Recurso financeiro estimado no ano (R$) - Outras]]),\"\")","v":""}]
[null,null,null,null,null,null,null,null,null,null,null,null,null,null,null,null,null,null,null,null,{"$f":"IF(SUM(PAPI20_22_23[[#This Row],[Recurso financeiro estimado no ano\n(R$) - Cobrança Estadual]:[Recurso financeiro estimado no ano (R$) - Outras]]) >0,SUM(PAPI20_22_23[[#This Row],[Recurso financeiro estimado no ano\n(R$) - Cobrança Estadual]:[Recurso financeiro estimado no ano (R$) - Outras]]),\"\")","v":""}]
[null,null,null,null,null,null,null,null,null,null,null,null,null,null,null,null,null,null,null,null,{"$f":"IF(SUM(PAPI20_22_23[[#This Row],[Recurso financeiro estimado no ano\n(R$) - Cobrança Estadual]:[Recurso financeiro estimado no ano (R$) - Outras]]) >0,SUM(PAPI20_22_23[[#This Row],[Recurso financeiro estimado no ano\n(R$) - Cobrança Estadual]:[Recurso financeiro estimado no ano (R$) - Outras]]),\"\")","v":""}]
[null,null,null,null,null,null,null,null,null,null,null,null,null,null,null,null,null,null,null,null,{"$f":"IF(SUM(PAPI20_22_23[[#This Row],[Recurso financeiro estimado no ano\n(R$) - Cobrança Estadual]:[Recurso financeiro estimado no ano (R$) - Outras]]) >0,SUM(PAPI20_22_23[[#This Row],[Recurso financeiro estimado no ano\n(R$) - Cobrança Estadual]:[Recurso financeiro estimado no ano (R$) - Outras]]),\"\")","v":""}]
[null,null,null,null,null,null,null,null,null,null,null,null,null,null,null,null,null,null,null,null,{"$f":"IF(SUM(PAPI20_22_23[[#This Row],[Recurso financeiro estimado no ano\n(R$) - Cobrança Estadual]:[Recurso financeiro estimado no ano (R$) - Outras]]) >0,SUM(PAPI20_22_23[[#This Row],[Recurso financeiro estimado no ano\n(R$) - Cobrança Estadual]:[Recurso financeiro estimado no ano (R$) - Outras]]),\"\")","v":""}]
[null,null,null,null,null,null,null,null,null,null,null,null,null,null,null,null,null,null,null,null,{"$f":"IF(SUM(PAPI20_22_23[[#This Row],[Recurso financeiro estimado no ano\n(R$) - Cobrança Estadual]:[Recurso financeiro estimado no ano (R$) - Outras]]) >0,SUM(PAPI20_22_23[[#This Row],[Recurso financeiro estimado no ano\n(R$) - Cobrança Estadual]:[Recurso financeiro estimado no ano (R$) - Outras]]),\"\")","v":""}]
[null,null,null,null,null,null,null,null,null,null,null,null,null,null,null,null,null,null,null,null,{"$f":"IF(SUM(PAPI20_22_23[[#This Row],[Recurso financeiro estimado no ano\n(R$) - Cobrança Estadual]:[Recurso financeiro estimado no ano (R$) - Outras]]) >0,SUM(PAPI20_22_23[[#This Row],[Recurso financeiro estimado no ano\n(R$) - Cobrança Estadual]:[Recurso financeiro estimado no ano (R$) - Outras]]),\"\")","v":""}]
[null,null,null,null,null,null,null,null,null,null,null,null,null,null,null,null,null,null,null,null,{"$f":"IF(SUM(PAPI20_22_23[[#This Row],[Recurso financeiro estimado no ano\n(R$) - Cobrança Estadual]:[Recurso financeiro estimado no ano (R$) - Outras]]) >0,SUM(PAPI20_22_23[[#This Row],[Recurso financeiro estimado no ano\n(R$) - Cobrança Estadual]:[Recurso financeiro estimado no ano (R$) - Outras]]),\"\")","v":""}]
[null,null,null,null,null,null,null,null,null,null,null,null,null,null,null,null,null,null,null,null,{"$f":"IF(SUM(PAPI20_22_23[[#This Row],[Recurso financeiro estimado no ano\n(R$) - Cobrança Estadual]:[Recurso financeiro estimado no ano (R$) - Outras]]) >0,SUM(PAPI20_22_23[[#This Row],[Recurso financeiro estimado no ano\n(R$) - Cobrança Estadual]:[Recurso financeiro estimado no ano (R$) - Outras]]),\"\")","v":""}]
[null,null,null,null,null,null,null,null,null,null,null,null,null,null,null,null,null,null,null,null,{"$f":"IF(SUM(PAPI20_22_23[[#This Row],[Recurso financeiro estimado no ano\n(R$) - Cobrança Estadual]:[Recurso financeiro estimado no ano (R$) - Outras]]) >0,SUM(PAPI20_22_23[[#This Row],[Recurso financeiro estimado no ano\n(R$) - Cobrança Estadual]:[Recurso financeiro estimado no ano (R$) - Outras]]),\"\")","v":""}]
[null,null,null,null,null,null,null,null,null,null,null,null,null,null,null,null,null,null,null,null,{"$f":"IF(SUM(PAPI20_22_23[[#This Row],[Recurso financeiro estimado no ano\n(R$) - Cobrança Estadual]:[Recurso financeiro estimado no ano (R$) - Outras]]) >0,SUM(PAPI20_22_23[[#This Row],[Recurso financeiro estimado no ano\n(R$) - Cobrança Estadual]:[Recurso financeiro estimado no ano (R$) - Outras]]),\"\")","v":""}]
[null,null,null,null,null,null,null,null,null,null,null,null,null,null,null,null,null,null,null,null,{"$f":"IF(SUM(PAPI20_22_23[[#This Row],[Recurso financeiro estimado no ano\n(R$) - Cobrança Estadual]:[Recurso financeiro estimado no ano (R$) - Outras]]) >0,SUM(PAPI20_22_23[[#This Row],[Recurso financeiro estimado no ano\n(R$) - Cobrança Estadual]:[Recurso financeiro estimado no ano (R$) - Outras]]),\"\")","v":""}]
[null,null,null,null,null,null,null,null,null,null,null,null,null,null,null,null,null,null,null,null,{"$f":"IF(SUM(PAPI20_22_23[[#This Row],[Recurso financeiro estimado no ano\n(R$) - Cobrança Estadual]:[Recurso financeiro estimado no ano (R$) - Outras]]) >0,SUM(PAPI20_22_23[[#This Row],[Recurso financeiro estimado no ano\n(R$) - Cobrança Estadual]:[Recurso financeiro estimado no ano (R$) - Outras]]),\"\")","v":""}]
[null,null,null,null,null,null,null,null,null,null,null,null,null,null,null,null,null,null,null,null,{"$f":"IF(SUM(PAPI20_22_23[[#This Row],[Recurso financeiro estimado no ano\n(R$) - Cobrança Estadual]:[Recurso financeiro estimado no ano (R$) - Outras]]) >0,SUM(PAPI20_22_23[[#This Row],[Recurso financeiro estimado no ano\n(R$) - Cobrança Estadual]:[Recurso financeiro estimado no ano (R$) - Outras]]),\"\")","v":""}]
[null,null,null,null,null,null,null,null,null,null,null,null,null,null,null,null,null,null,null,null,{"$f":"IF(SUM(PAPI20_22_23[[#This Row],[Recurso financeiro estimado no ano\n(R$) - Cobrança Estadual]:[Recurso financeiro estimado no ano (R$) - Outras]]) >0,SUM(PAPI20_22_23[[#This Row],[Recurso financeiro estimado no ano\n(R$) - Cobrança Estadual]:[Recurso financeiro estimado no ano (R$) - Outras]]),\"\")","v":""}]
[null,null,null,null,null,null,null,null,null,null,null,null,null,null,null,null,null,null,null,null,{"$f":"IF(SUM(PAPI20_22_23[[#This Row],[Recurso financeiro estimado no ano\n(R$) - Cobrança Estadual]:[Recurso financeiro estimado no ano (R$) - Outras]]) >0,SUM(PAPI20_22_23[[#This Row],[Recurso financeiro estimado no ano\n(R$) - Cobrança Estadual]:[Recurso financeiro estimado no ano (R$) - Outras]]),\"\")","v":""}]
[null,null,null,null,null,null,null,null,null,null,null,null,null,null,null,null,null,null,null,null,{"$f":"IF(SUM(PAPI20_22_23[[#This Row],[Recurso financeiro estimado no ano\n(R$) - Cobrança Estadual]:[Recurso financeiro estimado no ano (R$) - Outras]]) >0,SUM(PAPI20_22_23[[#This Row],[Recurso financeiro estimado no ano\n(R$) - Cobrança Estadual]:[Recurso financeiro estimado no ano (R$) - Outras]]),\"\")","v":""}]
[null,null,null,null,null,null,null,null,null,null,null,null,null,null,null,null,null,null,null,null,{"$f":"IF(SUM(PAPI20_22_23[[#This Row],[Recurso financeiro estimado no ano\n(R$) - Cobrança Estadual]:[Recurso financeiro estimado no ano (R$) - Outras]]) >0,SUM(PAPI20_22_23[[#This Row],[Recurso financeiro estimado no ano\n(R$) - Cobrança Estadual]:[Recurso financeiro estimado no ano (R$) - Outras]]),\"\")","v":""}]
[null,null,null,null,null,null,null,null,null,null,null,null,null,null,null,null,null,null,null,null,{"$f":"IF(SUM(PAPI20_22_23[[#This Row],[Recurso financeiro estimado no ano\n(R$) - Cobrança Estadual]:[Recurso financeiro estimado no ano (R$) - Outras]]) >0,SUM(PAPI20_22_23[[#This Row],[Recurso financeiro estimado no ano\n(R$) - Cobrança Estadual]:[Recurso financeiro estimado no ano (R$) - Outras]]),\"\")","v":""}]
[null,null,null,null,null,null,null,null,null,null,null,null,null,null,null,null,null,null,null,null,{"$f":"IF(SUM(PAPI20_22_23[[#This Row],[Recurso financeiro estimado no ano\n(R$) - Cobrança Estadual]:[Recurso financeiro estimado no ano (R$) - Outras]]) >0,SUM(PAPI20_22_23[[#This Row],[Recurso financeiro estimado no ano\n(R$) - Cobrança Estadual]:[Recurso financeiro estimado no ano (R$) - Outras]]),\"\")","v":""}]
[null,null,null,null,null,null,null,null,null,null,null,null,null,null,null,null,null,null,null,null,{"$f":"IF(SUM(PAPI20_22_23[[#This Row],[Recurso financeiro estimado no ano\n(R$) - Cobrança Estadual]:[Recurso financeiro estimado no ano (R$) - Outras]]) >0,SUM(PAPI20_22_23[[#This Row],[Recurso financeiro estimado no ano\n(R$) - Cobrança Estadual]:[Recurso financeiro estimado no ano (R$) - Outras]]),\"\")","v":""}]
[null,null,null,null,null,null,null,null,null,null,null,null,null,null,null,null,null,null,null,null,{"$f":"IF(SUM(PAPI20_22_23[[#This Row],[Recurso financeiro estimado no ano\n(R$) - Cobrança Estadual]:[Recurso financeiro estimado no ano (R$) - Outras]]) >0,SUM(PAPI20_22_23[[#This Row],[Recurso financeiro estimado no ano\n(R$) - Cobrança Estadual]:[Recurso financeiro estimado no ano (R$) - Outras]]),\"\")","v":""}]
[null,null,null,null,null,null,null,null,null,null,null,null,null,null,null,null,null,null,null,null,{"$f":"IF(SUM(PAPI20_22_23[[#This Row],[Recurso financeiro estimado no ano\n(R$) - Cobrança Estadual]:[Recurso financeiro estimado no ano (R$) - Outras]]) >0,SUM(PAPI20_22_23[[#This Row],[Recurso financeiro estimado no ano\n(R$) - Cobrança Estadual]:[Recurso financeiro estimado no ano (R$) - Outras]]),\"\")","v":""}]
[null,null,null,null,null,null,null,null,null,null,null,null,null,null,null,null,null,null,null,null,{"$f":"IF(SUM(PAPI20_22_23[[#This Row],[Recurso financeiro estimado no ano\n(R$) - Cobrança Estadual]:[Recurso financeiro estimado no ano (R$) - Outras]]) >0,SUM(PAPI20_22_23[[#This Row],[Recurso financeiro estimado no ano\n(R$) - Cobrança Estadual]:[Recurso financeiro estimado no ano (R$) - Outras]]),\"\")","v":""}]
[null,null,null,null,null,null,null,null,null,null,null,null,null,null,null,null,null,null,null,null,{"$f":"IF(SUM(PAPI20_22_23[[#This Row],[Recurso financeiro estimado no ano\n(R$) - Cobrança Estadual]:[Recurso financeiro estimado no ano (R$) - Outras]]) >0,SUM(PAPI20_22_23[[#This Row],[Recurso financeiro estimado no ano\n(R$) - Cobrança Estadual]:[Recurso financeiro estimado no ano (R$) - Outras]]),\"\")","v":""}]
[null,null,null,null,null,null,null,null,null,null,null,null,null,null,null,null,null,null,null,null,{"$f":"IF(SUM(PAPI20_22_23[[#This Row],[Recurso financeiro estimado no ano\n(R$) - Cobrança Estadual]:[Recurso financeiro estimado no ano (R$) - Outras]]) >0,SUM(PAPI20_22_23[[#This Row],[Recurso financeiro estimado no ano\n(R$) - Cobrança Estadual]:[Recurso financeiro estimado no ano (R$) - Outras]]),\"\")","v":""}]
[null,null,null,null,null,null,null,null,null,null,null,null,null,null,null,null,null,null,null,null,{"$f":"IF(SUM(PAPI20_22_23[[#This Row],[Recurso financeiro estimado no ano\n(R$) - Cobrança Estadual]:[Recurso financeiro estimado no ano (R$) - Outras]]) >0,SUM(PAPI20_22_23[[#This Row],[Recurso financeiro estimado no ano\n(R$) - Cobrança Estadual]:[Recurso financeiro estimado no ano (R$) - Outras]]),\"\")","v":""}]
[null,null,null,null,null,null,null,null,null,null,null,null,null,null,null,null,null,null,null,null,{"$f":"IF(SUM(PAPI20_22_23[[#This Row],[Recurso financeiro estimado no ano\n(R$) - Cobrança Estadual]:[Recurso financeiro estimado no ano (R$) - Outras]]) >0,SUM(PAPI20_22_23[[#This Row],[Recurso financeiro estimado no ano\n(R$) - Cobrança Estadual]:[Recurso financeiro estimado no ano (R$) - Outras]]),\"\")","v":""}]
[null,null,null,null,null,null,null,null,null,null,null,null,null,null,null,null,null,null,null,null,{"$f":"IF(SUM(PAPI20_22_23[[#This Row],[Recurso financeiro estimado no ano\n(R$) - Cobrança Estadual]:[Recurso financeiro estimado no ano (R$) - Outras]]) >0,SUM(PAPI20_22_23[[#This Row],[Recurso financeiro estimado no ano\n(R$) - Cobrança Estadual]:[Recurso financeiro estimado no ano (R$) - Outras]]),\"\")","v":""}]
[null,null,null,null,null,null,null,null,null,null,null,null,null,null,null,null,null,null,null,null,{"$f":"IF(SUM(PAPI20_22_23[[#This Row],[Recurso financeiro estimado no ano\n(R$) - Cobrança Estadual]:[Recurso financeiro estimado no ano (R$) - Outras]]) >0,SUM(PAPI20_22_23[[#This Row],[Recurso financeiro estimado no ano\n(R$) - Cobrança Estadual]:[Recurso financeiro estimado no ano (R$) - Outras]]),\"\")","v":""}]

{"sheet":"Identificação das ações 24-27","index":1,"n_rows":79,"n_cols":13,"rows_kept":79,"cut":false,"hidden":false,"merged":[]}
["ID Ação","Descrição da ação","SubPDC","Prioridade do PDC","É (ou será)  empreendimento FEHIDRO?","Requer recursos financeiros?","Quantidade de fontes de recursos ","Segmento do executor","Área de abrangência","Detalhamento da área de abrangência","Início estimado da ação","Fim estimado","Observações"]
["PCJ3.3.1.2/2024","Fomento a Planos Municipais de Saneamento Rural","1.2 - Planejamento","PDC 1 e 2","Sim","Sim",2,"Município","Bacia","Bacias PCJ, observando os municípios e ACs prioritários para saneamento rural","2025-07-01","2029-12-31","Para recursos FEHIDRO, está sendo considerado o provável início da ação, após todo fluxo de análise do AT/AF e assinatura do contrato"]
["PCJ2.3.1.1/2024","Estudos de viabilidade para aumento de regularização de vazões em mananciais existentes e novos barramentos","1.2 - Planejamento","PDC 1 e 2","Sim","Sim",1,"Município","Corpo hídrico","Bacias PCJ, observando os municípios e ACs prioritários","2025-07-01","2029-12-31","Para recursos FEHIDRO, está sendo considerado o provável início da ação, após todo fluxo de análise do AT/AF e assinatura do contrato"]
["PCJ2.3.3.2/2024","Elaboração dos Planos Diretores de Drenagem Urbana e Manejo de Águas Pluviais","1.2 - Planejamento","PDC 1 e 2","Sim","Sim",1,"Município","Município","Municípios observando as prioridades no Plano de Bacias","2025-07-01","2029-12-31","Para recursos FEHIDRO, está sendo considerado o provável início da ação, após todo fluxo de análise do AT/AF e assinatura do contrato"]
["PCJ1.2.1.5/2024","Cadastro, caracterização e modelagem de cargas industriais","1.2 - Planejamento","PDC 1 e 2","Sim","Sim",1,"Sociedade Civil","Bacia","Bacias PCJ","2025-07-01","2025-12-31","Para recursos FEHIDRO, está sendo considerado o provável início da ação, após todo fluxo de análise do AT/AF e assinatura do contrato"]
["PCJ1.2.1.6/2026","Estudos de alternativas de diminuição da carga industrial","1.2 - Planejamento","PDC 1 e 2","Sim","Sim",1,"Sociedade Civil","Bacia","Bacias PCJ, especialmente em municípios prioritários para tratamento secundário, nitrogênio e fósforo","2027-07-01","2028-12-31","Para recursos FEHIDRO, está sendo considerado o provável início da ação, após todo fluxo de análise do AT/AF e assinatura do contrato"]
["PCJ1.2.2.1/2026","Elaboração de estudos sobre os impactos da cloração de efluentes nos mananciais","1.2 - Planejamento","PDC 1 e 2","Sim","Sim",1,"Sociedade Civil","Bacia","Bacias PCJ","2027-07-01","2028-12-31","Para recursos FEHIDRO, está sendo considerado o provável início da ação, após todo fluxo de análise do AT/AF e assinatura do contrato"]
["PCJ1.3.1.1/2027","Elaboração de estudo do background de fósforo nos corpos hídricos das Bacias PCJ e integração no SSD","1.2 - Planejamento","PDC 1 e 2","Sim","Sim",1,"Sociedade Civil","Bacia","Bacias PCJ","2028-07-01","2029-12-31","Para recursos FEHIDRO, está sendo considerado o provável início da ação, após todo fluxo de análise do AT/AF e assinatura do contrato"]
["PCJ1.3.1.3/2026","Elaboração de estudo sobre estruturas de controle e redução de cargas difusas e definição de metodologia para identificação e priorização de áreas potencialmente afetadas por cargas difusas de origem rural e urbana","1.2 - Planejamento","PDC 1 e 2","Sim","Sim",1,"Sociedade Civil","Bacia","Bacias PCJ","2027-07-01","2028-12-31","Para recursos FEHIDRO, está sendo considerado o provável início da ação, após todo fluxo de análise do AT/AF e assinatura do contrato"]
["PCJ1.3.2.2/2026","Elaboração de um Plano de Contenção de Cargas Difusas em locais prioritários nas Bacias PCJ","1.2 - Planejamento","PDC 1 e 2","Sim","Sim",1,"Sociedade Civil","Bacia","Bacias PCJ, observando as prioridades para fósforo e nitrogênio.","2027-07-01","2028-12-31","Para recursos FEHIDRO, está sendo considerado o provável início da ação, após todo fluxo de análise do AT/AF e assinatura do contrato"]
["PCJ6.3.2.1/2025","Estudo para articulação entre CBHs visando a pactuação de condições de entrega","1.2 - Planejamento","PDC 1 e 2","Sim","Sim",1,"Sociedade Civil","Bacia","Bacias PCJ","2026-07-01","2027-12-31","Para recursos FEHIDRO, está sendo considerado o provável início da ação, após todo fluxo de análise do AT/AF e assinatura do contrato"]
["PCJ1.1.1.2/2025","Elaboração de estudos para ampliação e melhoria dos sistemas de transporte de esgotos","1.2 - Planejamento","PDC 1 e 2","Sim","Sim",1,"Município","Município","Municípios observando as prioridades no Plano de Bacias","2026-07-01","2029-12-31","Para recursos FEHIDRO, está sendo considerado o provável início da ação, após todo fluxo de análise do AT/AF e assinatura do contrato"]
["PCJ1.1.2.2/2025","Elaboração de estudos para a implantação de novas ETEs visando tratamento secundário","1.2 - Planejamento","PDC 1 e 2","Sim","Sim",1,"Município","Município","Municípios observando as prioridades para tratamento no Plano de Bacias","2026-07-01","2029-12-31","Para recursos FEHIDRO, está sendo considerado o provável início da ação, após todo fluxo de análise do AT/AF e assinatura do contrato"]
["PCJ1.2.1.1/2025","Elaboração de estudos de melhorias da eficiência das ETEs na remoção de nutrientes","1.2 - Planejamento","PDC 1 e 2","Sim","Sim",1,"Município","Município","Municípios observando as prioridades para remoção de nitrogênio e fósforo, no Plano de Bacias","2026-07-01","2029-12-31","Para recursos FEHIDRO, está sendo considerado o provável início da ação, após todo fluxo de análise do AT/AF e assinatura do contrato"]
["PCJ1.1.2.4/2024","Elaboração de estudos e relatórios visando o licenciamento das ETEs projetadas","1.2 - Planejamento","PDC 1 e 2","Sim","Sim",1,"Município","Município","Municípios observando as prioridades no Plano de Bacias","2025-07-01","2028-12-31","Para recursos FEHIDRO, está sendo considerado o provável início da ação, após todo fluxo de análise do AT/AF e assinatura do contrato"]
["PCJ1.2.1.7/2024","Elaboração e revisão de planos municipais de saneamento básico","1.2 - Planejamento","PDC 1 e 2","Sim","Sim",1,"Município","Município","Municípios observando as prioridades no Plano de Bacias","2025-07-01","2028-12-31","Para recursos FEHIDRO, está sendo considerado o provável início da ação, após todo fluxo de análise do AT/AF e assinatura do contrato"]
["PCJ2.3.2.1/2024","Elaboração e revisão de Planos de Controle e Redução de Perdas","1.2 - Planejamento","PDC 1 e 2","Sim","Sim",1,"Município","Município","Municípios observando as prioridades no Plano de Bacias","2025-07-01","2028-12-31","Para recursos FEHIDRO, está sendo considerado o provável início da ação, após todo fluxo de análise do AT/AF e assinatura do contrato"]
["PCJ2.2.4.1/2024","Desenvolvimento de estudo de alternativas de aumento da disponibilidade hídrica nas sub-bacias dos rios Atibaia, Jundiaí e Capivari","1.2 - Planejamento","PDC 1 e 2","Sim","Sim",1,"Sociedade Civil","Sub-bacia","Sub-bacias Atibaia, Jundiaí e Capivari","2025-07-01","2026-12-31","Para recursos FEHIDRO, está sendo considerado o provável início da ação, após todo fluxo de análise do AT/AF e assinatura do contrato"]
["PCJ4.2.1.1/2026","Desenvolver estudo regional hidrogeológico nas Bacias PCJ","1.2 - Planejamento","PDC 1 e 2","Sim","Sim",1,"Sociedade Civil","Bacia","Bacias PCJ","2027-07-01","2028-12-31","Para recursos FEHIDRO, está sendo considerado o provável início da ação, após todo fluxo de análise do AT/AF e assinatura do contrato"]
["PCJ4.2.1.2/2026","Desenvolvimento de estudo para estimativa de balanços hídricos e recargas nas Bacias PCJ","1.2 - Planejamento","PDC 1 e 2","Sim","Sim",1,"Sociedade Civil","Bacia","Bacias PCJ","2027-07-01","2028-12-31","Para recursos FEHIDRO, está sendo considerado o provável início da ação, após todo fluxo de análise do AT/AF e assinatura do contrato"]
["PCJ4.2.1.3/2027","Delimitar as principais áreas de recarga e estabelecer diretrizes de proteção","1.2 - Planejamento","PDC 1 e 2","Sim","Sim",1,"Sociedade Civil","Bacia","Bacias PCJ","2028-07-01","2029-12-31","Para recursos FEHIDRO, está sendo considerado o provável início da ação, após todo fluxo de análise do AT/AF e assinatura do contrato"]
["PCJ4.2.2.1/2027","Elaboração do estudo hidrogeológico do aquífero Tubarão","1.2 - Planejamento","PDC 1 e 2","Sim","Sim",1,"Sociedade Civil","Bacia","Bacias PCJ","2028-07-01","2029-12-31","Para recursos FEHIDRO, está sendo considerado o provável início da ação, após todo fluxo de análise do AT/AF e assinatura do contrato"]
["PCJ6.3.1.4/2025","Estabelecer parcerias para pesquisa com universidade e institutos","1.2 - Planejamento","PDC 1 e 2","Sim","Sim",1,"Sociedade Civil","Bacia","Bacias PCJ","2026-07-01","2027-12-31","Para recursos FEHIDRO, está sendo considerado o provável início da ação, após todo fluxo de análise do AT/AF e assinatura do contrato"]
["PCJ4.1.1.2/2027","Desenvolvimento de banco de dados de poços e suporte à decisão","2.2 - Outorga","PDC 1 e 2","Sim","Sim",1,"Estado","Bacia","Bacias PCJ","2027-07-01","2028-12-31","Para recursos FEHIDRO, está sendo considerado o provável início da ação, após todo fluxo de análise do AT/AF e assinatura do contrato"]
["PCJ6.2.5.1/2024","Desenvolvimento de um plano de fiscalização de Outorgas em apoio ao órgão gestor ","2.2 - Outorga","PDC 1 e 2","Sim","Sim",1,"Estado","Bacia","Bacias PCJ","-","-","Para recursos FEHIDRO, está sendo considerado o provável início da ação, após todo fluxo de análise do AT/AF e assinatura do contrato"]
["PCJ6.2.3.2/2026","Monitoramento de chuva, vazão, qualidade e nível de água subterrânea em pequenas bacias hidrográficas","2.5 - Redes de monitoramento e SI","PDC 1 e 2","Sim","Sim",1,"Sociedade Civil","Bacia","Bacias PCJ","2027-07-01","2029-12-31","Para recursos FEHIDRO, está sendo considerado o provável início da ação, após todo fluxo de análise do AT/AF e assinatura do contrato"]
["PCJ6.2.3.3/2026","Implantação, integração, operação e manutenção da rede de monitoramento quali-quantitativo das águas subterrâneas","2.5 - Redes de monitoramento e SI","PDC 1 e 2","Sim","Sim",1,"Sociedade Civil","Bacia","Bacias PCJ","2027-07-01","2028-12-31","Para recursos FEHIDRO, está sendo considerado o provável início da ação, após todo fluxo de análise do AT/AF e assinatura do contrato"]
["PCJ6.3.1.3/2025","Fomentar a adequação das redes de monitoramento","2.5 - Redes de monitoramento e SI","PDC 1 e 2","Sim","Sim",1,"Sociedade Civil","Bacia","Bacia Hidrográfica do rio Tietê","2026-07-01","2027-12-31","Para recursos FEHIDRO, está sendo considerado o provável início da ação, após todo fluxo de análise do AT/AF e assinatura do contrato"]
["PCJ6.3.1.6/2026","Integrar dados de monitoramento quali-quantitativos","2.5 - Redes de monitoramento e SI","PDC 1 e 2","Sim","Sim",1,"Sociedade Civil","Bacia","Bacia Hidrográfica do rio Tietê","2027-07-01","2028-12-31","Para recursos FEHIDRO, está sendo considerado o provável início da ação, após todo fluxo de análise do AT/AF e assinatura do contrato"]
["PCJ6.3.2.2/2025","Apoio à gestão administrativa da Fundação da Agência da Bacia Hidrográfica dos Rios Sorocaba e Médio Tietê","2.7 - CORHI","PDC 1 e 2","Sim","Sim",1,"Sociedade Civil","Bacia","Bacia Hidrográfica do rio Tietê","2026-07-01","2027-12-31","Para recursos FEHIDRO, está sendo considerado o provável início da ação, após todo fluxo de análise do AT/AF e assinatura do contrato"]
["PCJ6.3.1.1/2025","Discutir a possibilidade de implantação de agências de bacia","2.7 - CORHI","PDC 1 e 2","Sim","Sim",1,"Sociedade Civil","Bacia","Bacia Hidrográfica do rio Tietê","2026-07-01","2027-12-31","Para recursos FEHIDRO, está sendo considerado o provável início da ação, após todo fluxo de análise do AT/AF e assinatura do contrato"]
["PCJ3.3.1.1/2024","Substituição de sistemas rudimentares de tratamento de esgoto (fossa negra) por sistemas mais eficientes","3.1 - Efluentes","Prioritário","Sim","Sim",1,"Município","Município","Município","2025-07-01","2029-12-31","Para recursos FEHIDRO, está sendo considerado o provável início da ação, após todo fluxo de análise do AT/AF e assinatura do contrato"]
["PCJ1.1.1.4/2024","Elaboração de projetos de ampliação e melhoria dos sistemas de transporte de esgotos","3.1 - Efluentes","Prioritário","Sim","Sim",1,"Município","Município","Municípios observando asprioridades para remoção de nitrogênio e fósforo, no Plano de Bacias","2025-07-01","2029-12-31","Para recursos FEHIDRO, está sendo considerado o provável início da ação, após todo fluxo de análise do AT/AF e assinatura do contrato"]
["PCJ1.1.2.3/2024","Elaboração de projetos para a implantação de novas ETEs visando tratamento secundário","3.1 - Efluentes","Prioritário","Sim","Sim",1,"Município","Município","Municípios observando as prioridades para remoção de nitrogênio e fósforo, no Plano de Bacias","2025-07-01","2029-12-31","Para recursos FEHIDRO, está sendo considerado o provável início da ação, após todo fluxo de análise do AT/AF e assinatura do contrato"]
["PCJ1.2.1.2/2024","Elaboração de projetos de melhorias da eficiência das ETEs na remoção de nutrientes","3.1 - Efluentes","Prioritário","Sim","Sim",1,"Município","Município","Municípios observando as prioridades para remoção de nitrogênio e fósforo, no Plano de Bacias","2025-07-01","2029-12-31","Para recursos FEHIDRO, está sendo considerado o provável início da ação, após todo fluxo de análise do AT/AF e assinatura do contrato"]
["PCJ1.2.2.2/2027","Elaboração de projetos de implantação de tecnologias de desinfecção de efluentes domésticos","3.1 - Efluentes","Prioritário","Sim","Sim",1,"Município","Município","Municípios observando as prioridades no Plano de Bacias","2028-07-01","2029-12-31","Para recursos FEHIDRO, está sendo considerado o provável início da ação, após todo fluxo de análise do AT/AF e assinatura do contrato"]
["PCJ3.1.2.3/2024","Incentivo à proteção das áreas sujeitas à restrição de uso","4.2 - Soluções baseadas Natureza","Não prioritário","Sim","Sim",1,"Sociedade Civil","Sub-bacia","ACs prioritárias conforme mapa síntese  Mapa  Conservação, recuperação de nascentes, matas ciliares e áreas de recarga","-","-","Para recursos FEHIDRO, está sendo considerado o provável início da ação, após todo fluxo de análise do AT/AF e assinatura do contrato"]
["PCJ2.3.2.2/2024","Controle de perdas em sistemas de abastecimento de água","5.1 - Perdas","Prioritário","Sim","Sim",1,"Município","Município","Para 2020, municípios prioritários indicados na Deliberação dos Comitês PCJ nº 324/2019. A partir de 2021, municípios observando as prioridades do Plano de Bacias","2025-07-01","2029-12-31","Para recursos FEHIDRO, está sendo considerado o provável início da ação, após todo fluxo de análise do AT/AF e assinatura do contrato"]
["PCJ5.2.2.1/2024","Elaboração de propostas para órgãos de financiamento em pesquisas","8.1 - Capacitação","Não prioritário","Sim","Sim",1,"Sociedade Civil","Bacia","Bacias PCJ","-","-","Para recursos FEHIDRO, está sendo considerado o provável início da ação, após todo fluxo de análise do AT/AF e assinatura do contrato"]
["PCJ5.2.2.3/2024","Apoio ao desenvolvimento e difusão de pesquisas e tecnologias que contribuam no enfrentamento dos desafios identificados no Plano das Bacias PCJ","8.2 - Educação","Não prioritário","Sim","Sim",1,"Sociedade Civil","Bacia","Bacias PCJ","-","-","Para recursos FEHIDRO, está sendo considerado o provável início da ação, após todo fluxo de análise do AT/AF e assinatura do contrato"]
["PCJ6.2.5.2/2027","Apoio à regularização de outorga na área rural","8.3 - Comunicação","Não prioritário","Sim","Sim",1,"Sociedade Civil","Bacia","Bacias PCJ","2028-07-01","2029-12-31","Para recursos FEHIDRO, está sendo considerado o provável início da ação, após todo fluxo de análise do AT/AF e assinatura do contrato"]
["PCJ1.1.1.1/2024","Elaboração de estudos para ampliação e melhoria dos sistemas de coleta de esgotos","1.2 - Planejamento","PDC 1 e 2","Sim","Sim",1,"Município","Município","Municípios com prioridades para coleta, no Plano de Bacias","-","-","Para recursos FEHIDRO, está sendo considerado o provável início da ação, após todo fluxo de análise do AT/AF e assinatura do contrato"]
["PCJ2.2.3.1/2024","Acompanhamento e apoio aos estudos de viabilidade, projetos de engenharia e licenciamento ambiental das barragens de Pedreira, Duas Pontes e do ribeirão Piraí e do trecho Oeste do SAR","1.2 - Planejamento","PDC 1 e 2","Não","Sim",1,"Sociedade Civil","Bacia","Bacias PCJ","2025-07-01","2026-12-31","Para recursos FEHIDRO, está sendo considerado o provável início da ação, após todo fluxo de análise do AT/AF e assinatura do contrato"]
["PCJ2.3.3.1/2024","Elaboração de um guia de manejo de drenagem e manejo de águas pluviais","1.2 - Planejamento","PDC 1 e 2","Não","Sim",1,"Sociedade Civil","Bacia","Bacias PCJ","2024-12-01","2025-12-31","Para recursos FEHIDRO, está sendo considerado o provável início da ação, após todo fluxo de análise do AT/AF e assinatura do contrato"]
["PCJ1.3.1.2/2025","Elaboração de estudo piloto para avaliação da carga difusa de origem urbana e rural afluente nos corpos hídricos das Bacias PCJ","1.2 - Planejamento","PDC 1 e 2","Não","Sim",1,"Sociedade Civil","Bacia","Bacias PCJ","2025-12-01","2025-12-31","Para recursos FEHIDRO, está sendo considerado o provável início da ação, após todo fluxo de análise do AT/AF e assinatura do contrato"]
["PCJ6.2.5.3/2024","Apoio operacional para fiscalização de outorgas","2.2 - Outorga","PDC 1 e 2","Não","Sim",1,"Sociedade Civil","Bacia","Bacias PCJ","2024-03-29","2028-03-29","Para recursos FEHIDRO, está sendo considerado o provável início da ação, após todo fluxo de análise do AT/AF e assinatura do contrato"]
["PCJ6.1.1.2/2024","Apoio operacional para a área de cobrança pelo uso dos recursos hídricos","2.3 - Cobrança","PDC 1 e 2","Não","Sim",1,"Sociedade Civil","Bacia","Bacias PCJ","2024-07-01","2028-07-01","Para recursos FEHIDRO, está sendo considerado o provável início da ação, após todo fluxo de análise do AT/AF e assinatura do contrato"]
["PCJ6.1.1.5/2024","Apoio operacional para acompanhamento de projetos da área de Sistema de Informações ","2.5 - Redes de monitoramento e SI","PDC 1 e 2","Não","Sim",1,"Sociedade Civil","Bacia","Bacias PCJ","2024-08-17","2029-08-17","Para recursos FEHIDRO, está sendo considerado o provável início da ação, após todo fluxo de análise do AT/AF e assinatura do contrato"]
["PCJ6.2.3.1/2024","Expansão, integração, operação e manutenção da rede de monitoramento quali-quantitativo dos recursos hídricos","2.5 - Redes de monitoramento e SI","PDC 1 e 2","Não","Sim",1,"Sociedade Civil","Bacia","Bacias PCJ","2024-07-01","2027-12-31","Para recursos FEHIDRO, está sendo considerado o provável início da ação, após todo fluxo de análise do AT/AF e assinatura do contrato"]
["PCJ2.1.1.1/2024","Manutenção e aprimoramento de um modelo chuva-vazão para as Bacias PCJ","2.5 - Redes de monitoramento e SI","PDC 1 e 2","Não","Sim",1,"Sociedade Civil","Bacia","Bacias PCJ","2024-07-01","2027-12-31","Para recursos FEHIDRO, está sendo considerado o provável início da ação, após todo fluxo de análise do AT/AF e assinatura do contrato"]
["PCJ2.1.2.1/2025","Aprimoramento de modelo de simulação hidrodinâmica do tempo de trânsito e do amortecimento da vazão preferencialmente à jusante do Sistema Cantareira","2.5 - Redes de monitoramento e SI","PDC 1 e 2","Não","Sim",1,"Sociedade Civil","Bacia","Bacias PCJ","2025-07-01","2026-12-31","Para recursos FEHIDRO, está sendo considerado o provável início da ação, após todo fluxo de análise do AT/AF e assinatura do contrato"]
["PCJ6.2.6.1/2024","Apoio operacional para gerenciamento da implementação e da revisão do Plano de Bacias","2.6 - Integração","PDC 1 e 2","Não","Sim",1,"Sociedade Civil","Bacia","Bacias PCJ","2024-11-01","2025-12-31","Para recursos FEHIDRO, está sendo considerado o provável início da ação, após todo fluxo de análise do AT/AF e assinatura do contrato"]
["PCJ6.1.1.4/2024","Apoio Operacional para acompanhamento de empreendimentos de demanda espontânea","2.6 - Integração","PDC 1 e 2","Não","Sim",1,"Sociedade Civil","Bacia","Bacias PCJ","2021-02-03","2021-02-03","Para recursos FEHIDRO, está sendo considerado o provável início da ação, após todo fluxo de análise do AT/AF e assinatura do contrato"]
["PCJ6.1.2.2/2024","Remuneração de agentes técnicos e financeiros para empreendimentos deliberados pelos Comitês PCJ","2.6 - Integração","PDC 1 e 2","Não","Sim",1,"Sociedade Civil","Bacia","Bacias PCJ","2024-01-01","2024-12-31","Para recursos FEHIDRO, está sendo considerado o provável início da ação, após todo fluxo de análise do AT/AF e assinatura do contrato"]
["PCJ6.1.2.3/2024","Logística de Suporte às reuniões Plenárias e das CTs dos Comitês PCJ","2.6 - Integração","PDC 1 e 2","Não","Sim",1,"Sociedade Civil","Bacia","Bacias PCJ","2024-01-01","2024-12-31","Para recursos FEHIDRO, está sendo considerado o provável início da ação, após todo fluxo de análise do AT/AF e assinatura do contrato"]
["PCJ6.1.2.1/2024","Apoio operacional para a Secretaria Executiva dos Comitês PCJ","2.6 - Integração","PDC 1 e 2","Não","Sim",1,"Sociedade Civil","Bacia","Bacias PCJ","2024-01-01","2024-12-31","Para recursos FEHIDRO, está sendo considerado o provável início da ação, após todo fluxo de análise do AT/AF e assinatura do contrato"]
["PCJ6.1.1.7/2024","Apoio operacional para acompanhamento de ações da porção mineira","2.6 - Integração","PDC 1 e 2","Não","Sim",1,"Sociedade Civil","Bacia","Bacias PCJ","2024-01-01","2024-12-31","Para recursos FEHIDRO, está sendo considerado o provável início da ação, após todo fluxo de análise do AT/AF e assinatura do contrato"]
["PCJ6.1.1.1/2024","Apoio operacional para a Área de Tecnologia da Informação - TI","2.6 - Integração","PDC 1 e 2","Não","Sim",1,"Sociedade Civil","Bacia","Bacias PCJ","2024-01-01","2024-12-31","Para recursos FEHIDRO, está sendo considerado o provável início da ação, após todo fluxo de análise do AT/AF e assinatura do contrato"]
["PCJ6.1.2.4/2024","Participação de membros dos Comitês PCJ em eventos internos das CTs e eventos externos","2.6 - Integração","PDC 1 e 2","Não","Sim",1,"Sociedade Civil","Bacia","Bacias PCJ","2024-01-01","2024-12-31","Para recursos FEHIDRO, está sendo considerado o provável início da ação, após todo fluxo de análise do AT/AF e assinatura do contrato"]
["PCJ6.1.2.5/2024","Manutenção de licenciamento de sistemas de TI","2.7 - CORHI","PDC 1 e 2","Não","Sim",1,"Sociedade Civil","Bacia","Bacias PCJ","2024-11-02","2025-11-02","Para recursos FEHIDRO, está sendo considerado o provável início da ação, após todo fluxo de análise do AT/AF e assinatura do contrato"]
["PCJ1.2.2.3/2024","Implantação das tecnologias de desinfecção projetadas","3.1 - Efluentes","Prioritário","Sim","Sim",1,"Município","Município","Municípios observando as prioridades para coliformes termotolerantes no Plano de Bacias","2024-07-01","2029-12-31","Para recursos FEHIDRO, está sendo considerado o provável início da ação, após todo fluxo de análise do AT/AF e assinatura do contrato"]
["PCJ1.1.2.5/2024","Implantação das ETEs projetadas e melhorias das ETEs existentes","3.1 - Efluentes","Prioritário","Sim","Sim",1,"Município","Município","Municípios observando as prioridades para tratamento  no Plano de Bacias","2024-07-01","2029-12-31","Para recursos FEHIDRO, está sendo considerado o provável início da ação, após todo fluxo de análise do AT/AF e assinatura do contrato"]
["PCJ1.2.1.9/2024","Implantação das melhorias das ETEs projetadas e retrofit de ETEs para remoção de nutrientes","3.1 - Efluentes","Prioritário","Sim","Sim",1,"Município","Município","Municípios observando as prioridades para remoção de nitrogênio e fósforo, no Plano de Bacias","2024-07-01","2029-12-31","Para recursos FEHIDRO, está sendo considerado o provável início da ação, após todo fluxo de análise do AT/AF e assinatura do contrato"]
["PCJ1.2.1.8/2024","Implantação de Unidades de Tratamento de Lodo nas ETAs","3.1 - Efluentes","Prioritário","Sim","Sim",1,"Município","Município","Municípios observando as prioridades para tratamento  no Plano de Bacias","2024-07-01","2029-12-31","Para recursos FEHIDRO, está sendo considerado o provável início da ação, após todo fluxo de análise do AT/AF e assinatura do contrato"]
["PCJ1.1.1.3/2024","Elaboração de projetos de ampliação e melhoria dos sistemas de coleta de esgotos","3.1 - Efluentes","Prioritário","Não","Sim",1,"Município","Município","Municípios observando as prioridades para tratamento  no Plano de Bacias","-","-","Para recursos FEHIDRO, está sendo considerado o provável início da ação, após todo fluxo de análise do AT/AF e assinatura do contrato"]
["PCJ1.1.1.5/2024","Ampliações e melhoria dos sistemas de coleta de esgotos","3.1 - Efluentes","Prioritário","Sim","Sim",1,"Município","Município","Municípios com prioridades para coleta, no Plano de Bacias","2024-07-01","2027-12-31","Para recursos FEHIDRO, está sendo considerado o provável início da ação, após todo fluxo de análise do AT/AF e assinatura do contrato"]
["PCJ1.3.2.1/2024","Elaboração de projetos demonstrativos para contenção de cargas difusas de origem rural e urbana","3.2 - Poluição","Prioritário","Não","Sim",1,"Sociedade Civil","Bacia","Bacias PCJ, observando as prioridades para fósforo e nitrogênio.","-","-","Para recursos FEHIDRO, está sendo considerado o provável início da ação, após todo fluxo de análise do AT/AF e assinatura do contrato"]
["PCJ1.3.2.3/2024","Implantação de medidas de contenção de cargas difusas de origem rural e urbana em locais prioritários","3.2 - Poluição","Prioritário","Não","Sim",1,"Município","Bacia","Bacias PCJ observando as prioridades para fósforo e nitrogênio","-","-","Para recursos FEHIDRO, está sendo considerado o provável início da ação, após todo fluxo de análise do AT/AF e assinatura do contrato"]
["PCJ3.1.2.5/2024","Estabilização de voçorocas nas propriedades que receberão projetos de recomposição florestal (fonte: PDRF)","4.1 - Controle erosão","Não prioritário","Não","Sim",1,"Sociedade Civil","Bacia","Áreas de Contribuição das Bacias PCJ prioritárias conforme mapa síntese Mapa Conservação, recuperação de nascentes, matas ciliares e áreas de recarga do Plano  de Bacias","-","-","Para recursos FEHIDRO, está sendo considerado o provável início da ação, após todo fluxo de análise do AT/AF e assinatura do contrato"]
["PCJ6.1.1.3/2024","Apoio operacional para acompanhamento de projetos de assessoria ambiental","4.2 - Soluções baseadas Natureza","Não prioritário","Não","Sim",1,"Sociedade Civil","Bacia","Áreas de Contribuição das Bacias PCJ prioritárias conforme mapa síntese Mapa Conservação, recuperação de nascentes, matas ciliares e áreas de recarga do Plano  de Bacias","2024-04-01","2024-12-31","Para recursos FEHIDRO, está sendo considerado o provável início da ação, após todo fluxo de análise do AT/AF e assinatura do contrato"]
["PCJ3.1.2.1/2024","Promoção da conservação e recuperação de nascentes, matas ciliares e áreas de recarga","4.2 - Soluções baseadas Natureza","Não prioritário","Não","Sim",1,"Sociedade Civil","Bacia","Áreas de Contribuição das Bacias PCJ prioritárias conforme mapa síntese Mapa Conservação, recuperação de nascentes, matas ciliares e áreas de recarga do Plano  de Bacias","2024-07-01","2024-12-31","Para recursos FEHIDRO, está sendo considerado o provável início da ação, após todo fluxo de análise do AT/AF e assinatura do contrato"]
["PCJ3.1.3.1/2024","Implementação de projetos de PSA","4.2 - Soluções baseadas Natureza","Não prioritário","Não","Sim",1,"Sociedade Civil","Bacia","Áreas de Contribuição das Bacias PCJ prioritárias conforme mapa síntese Mapa Conservação, recuperação de nascentes, matas ciliares e áreas de recarga do Plano  de Bacias","-","-","Para recursos FEHIDRO, está sendo considerado o provável início da ação, após todo fluxo de análise do AT/AF e assinatura do contrato"]
["PCJ3.1.1.1/2024","Desenvolvimento e monitoramento da implementação dos PIPs","4.3 - Mananciais","Não prioritário","Não","Sim",1,"Sociedade Civil","Bacia","Bacias PCJ","2024-07-01","2024-12-31","Para recursos FEHIDRO, está sendo considerado o provável início da ação, após todo fluxo de análise do AT/AF e assinatura do contrato"]
["PCJ5.3.1.2/2024","Elaboração de um Plano de Capacitação Técnica e realização de processos formativos nas áreas de atuação das Câmaras Técnicas","8.1 - Capacitação","Não prioritário","Não","Sim",1,"Sociedade Civil","Bacia","Bacias PCJ","2024-04-01","2024-12-31","Para recursos FEHIDRO, está sendo considerado o provável início da ação, após todo fluxo de análise do AT/AF e assinatura do contrato"]
["PCJ1.4.1.2/2024","Ampliação e divulgação do programa de capacitação (Escola da Água e Saneamento), fomento e incentivo à capacitação de operadores","8.1 - Capacitação","Não prioritário","Não","Sim",1,"Sociedade Civil","Bacia","Bacias PCJ","2024-07-01","2024-12-31","Para recursos FEHIDRO, está sendo considerado o provável início da ação, após todo fluxo de análise do AT/AF e assinatura do contrato"]
["PCJ5.2.1.2/2024","Realização de processos formativos e campanhas educativas sobre a realidade das Bacias PCJ","8.2 - Educação","Não prioritário","Não","Sim",1,"Sociedade Civil","Bacia","Bacias PCJ","2024-12-01","2025-12-01","Para recursos FEHIDRO, está sendo considerado o provável início da ação, após todo fluxo de análise do AT/AF e assinatura do contrato"]
["PCJ5.1.1.1/2024","Elaboração e execução de um Plano de Comunicação para o fortalecimento da comunicação entre a sociedade civil e os Comitês PCJ","8.3 - Comunicação","Não prioritário","Não","Sim",1,"Sociedade Civil","Bacia","Bacias PCJ","2024-09-01","2025-09-01","Para recursos FEHIDRO, está sendo considerado o provável início da ação, após todo fluxo de análise do AT/AF e assinatura do contrato"]
["PCJ6.1.1.6/2024","Apoio operacional para a área de comunicação social","8.3 - Comunicação","Não prioritário","Não","Sim",1,"Sociedade Civil","Bacia","Bacias PCJ","2024-07-01","2025-07-01","Para recursos FEHIDRO, está sendo considerado o provável início da ação, após todo fluxo de análise do AT/AF e assinatura do contrato"]
["PCJ5.2.1.3/2024","Elaboração e divulgação de materiais educativos","8.3 - Comunicação","Não prioritário","Não","Sim",1,"Sociedade Civil","Bacia","Bacias PCJ","2024-07-31","2025-07-31","Para recursos FEHIDRO, está sendo considerado o provável início da ação, após todo fluxo de análise do AT/AF e assinatura do contrato"]

{"sheet":"Acompanhamento das metas 24-27","index":2,"n_rows":79,"n_cols":12,"rows_kept":79,"cut":false,"hidden":false,"merged":[]}
["ID","Descrição da ação","Meta do quadriênio","Meta 2024","% de execução física da meta (2024)","Meta 2025","% de execução física da meta (2025)","Meta 2026","% de execução física da meta (2026)","Meta 2027","% de execução física da meta (2027)","Observações"]
[{"$f":"IF(INDEX(IdentAcoes[],,1)=0,\"\",(INDEX(IdentAcoes[],,1)))","v":"PCJ3.3.1.2/2024"},{"$f":"IF(INDEX(IdentAcoes[],,4)=0,\"\",(INDEX(IdentAcoes[],,2)))","v":"Fomento a Planos Municipais de Saneamento Rural"},"15 Planos Municipais de Saneamento Rural elaborados",0,null,0,null,0,null,15,null,"Está previsto início das contratações para 2024 com início da execução em 2025."]
["PCJ2.3.1.1/2024","Estudos de viabilidade para aumento de regularização de vazões em mananciais existentes e novos barramentos","Termos de referência; Estudo elaborado",0,null,0,null,0,null,1,null,"Previsão de início em 2024 e conclusão em 2029"]
["PCJ2.3.3.2/2024","Elaboração dos Planos Diretores de Drenagem Urbana e Manejo de Águas Pluviais","Elaboração de ao menos 01 Plano, considerando os trechos vulneráveis indicados no Plano de Bacias",0,null,0,null,0,null,1,null,"Previsão de início em 2024 e conclusão em 2029"]
["PCJ1.2.1.5/2024","Cadastro, caracterização e modelagem de cargas industriais","Ao menos 01 estudo realizado ",0,null,1,null,0,null,0,null,"Previsão de início em 2024 e execução em 2025"]
["PCJ1.2.1.6/2026","Estudos de alternativas de diminuição da carga industrial","Estudos realizados até 2026",0,null,0,null,0,null,1,null,"Previsão de início em 2026 e execução em 2027"]
["PCJ1.2.2.1/2026","Elaboração de estudos sobre os impactos da cloração de efluentes nos mananciais","Estudos realizados até 2026",0,null,0,null,0,null,1,null,"Previsão de início em 2026 e execução em 2027"]
["PCJ1.3.1.1/2027","Elaboração de estudo do background de fósforo nos corpos hídricos das Bacias PCJ e integração no SSD","Concentrações inseridas no SSD",0,null,0,null,0,null,0,null,"Previsão de início em 2027 e execução em 2028"]
["PCJ1.3.1.3/2026","Elaboração de estudo sobre estruturas de controle e redução de cargas difusas e definição de metodologia para identificação e priorização de áreas potencialmente afetadas por cargas difusas de origem rural e urbana","Estudo elaborado até final de 2026",0,null,0,null,1,null,0,null,"Estudo elaborado em 2026"]
["PCJ1.3.2.2/2026","Elaboração de um Plano de Contenção de Cargas Difusas em locais prioritários nas Bacias PCJ","Estudo elaborado até final de 2026",0,null,0,null,1,null,0,null,"Estudo elaborado em 2026"]
["PCJ6.3.2.1/2025","Estudo para articulação entre CBHs visando a pactuação de condições de entrega","Estudo elaborado até final de 2025",0,null,0,null,1,null,0,null,"Estudo elaborado em 2025, com envolvimento dos CBHs da vertente"]
["PCJ1.1.1.2/2025","Elaboração de estudos para ampliação e melhoria dos sistemas de transporte de esgotos","Elaboração de ao menos 01 estudo",0,null,0,null,0,null,1,null,"Previsão de início em 2025 e conclusão em 2029"]
["PCJ1.1.2.2/2025","Elaboração de estudos para a implantação de novas ETEs visando tratamento secundário","Elaboração de ao menos 01 estudo",0,null,0,null,0,null,1,null,"Previsão de início em 2025 e conclusão em 2029"]
["PCJ1.2.1.1/2025","Elaboração de estudos de melhorias da eficiência das ETEs na remoção de nutrientes","Elaboração de ao menos 01 estudo",0,null,0,null,0,null,1,null,"Previsão de início em 2025 e conclusão em 2029"]
["PCJ1.1.2.4/2024","Elaboração de estudos e relatórios visando o licenciamento das ETEs projetadas","Elaboração de ao menos 01 estudo",0,null,0,null,0,null,0,null,"Inicialmente sem recurso previsto para o quadriênio - Aguardando desdobramentos junto aos Comitês PCJ"]
["PCJ1.2.1.7/2024","Elaboração e revisão de planos municipais de saneamento básico","Ao menos 05 planos revisados/elaborados",0,null,0,null,0,null,5,null,"Está previsto início das contratações para 2024 com início da execução em 2025."]
["PCJ2.3.2.1/2024","Elaboração e revisão de Planos de Controle e Redução de Perdas","Ao menos 05 planos revisados/elaborados",0,null,0,null,0,null,5,null,"Está previsto início das contratações para 2024 com início da execução em 2025."]
["PCJ2.2.4.1/2024","Desenvolvimento de estudo de alternativas de aumento da disponibilidade hídrica nas sub-bacias dos rios Atibaia, Jundiaí e Capivari","Ao menos 01 estudo elaborado",0,null,1,null,0,null,0,null,"Previsão de início em 2024 e execução em 2025"]
["PCJ4.2.1.1/2026","Desenvolver estudo regional hidrogeológico nas Bacias PCJ","1. Desenvolvimento de termos de referência com arranjos institucionais e operacionais definidos; 2. Estudo desenvolvido e incorporado às práticas de gestão; 3. Validação por parte da CT-AS.",0,null,0,null,0,null,1,null,"Previsão de início em 2026 e execução em 2027"]
["PCJ4.2.1.2/2026","Desenvolvimento de estudo para estimativa de balanços hídricos e recargas nas Bacias PCJ","1. Termos de referência desenvolvidos com arranjos institucionais e operacionais definidos; 2. Estudo desenvolvido e incorporado às práticas de gestão; 3. Validação por parte da CT-AS",0,null,0,null,0,null,1,null,"Previsão de início em 2026 e execução em 2027"]
["PCJ4.2.1.3/2027","Delimitar as principais áreas de recarga e estabelecer diretrizes de proteção","1. Termos de referência desenvolvidos com arranjos operacionais definidos; 2. Estudo desenvolvido com mapas e diretrizes de proteção; 3. Validação por parte da CT-AS",0,null,0,null,0,null,0,null,"Previsão de início em 2027 e execução em 2028"]
["PCJ4.2.2.1/2027","Elaboração do estudo hidrogeológico do aquífero Tubarão","1. Realizar levantamentos e diagnósticos; 2. Definir e atualizar o modelo hidrogeológico conceitual; 3. Desenvolver modelos matemáticos; 4. Propor diretrizes para gestão de água subterrânea",0,null,0,null,0,null,0,null,"Previsão de início em 2027 e execução em 2028"]
["PCJ6.3.1.4/2025","Estabelecer parcerias para pesquisa com universidade e institutos","Ao menos 01 parceria firmada",0,null,1,null,0,null,0,null,"Previsão de início em 2025 e execução em 2025"]
["PCJ4.1.1.2/2027","Desenvolvimento de banco de dados de poços e suporte à decisão","Ao menos 01 banco de dados",0,null,0,null,0,null,0,null,"Previsão de início em 2027 e execução em 2028"]
["PCJ6.2.5.1/2024","Desenvolvimento de um plano de fiscalização de Outorgas em apoio ao órgão gestor ","1. Arranjo institucional formalizado; 2. Plano elaborado e executado; 3. Aumento da agilidade e precisão técnica na concessão de outorgas e maior efetividade da fiscalização",0,null,0,null,0,null,0,null,"Inicialmente sem recurso previsto para o quadriênio - Aguardando desdobramentos junto aos Comitês PCJ"]
["PCJ6.2.3.2/2026","Monitoramento de chuva, vazão, qualidade e nível de água subterrânea em pequenas bacias hidrográficas","1. Projeto da rede; 2. Implementação da rede; 3. Operação da rede; ",0,null,0,null,0,null,1,null,"Previsão de início em 2026 e conclusão em 2027"]
["PCJ6.2.3.3/2026","Implantação, integração, operação e manutenção da rede de monitoramento quali-quantitativo das águas subterrâneas","Disponibilização dos dados de ao menos 02 postos ativos ",0,null,0,null,0,null,2,null,"Previsão de início em 2026 e conclusão em 2027"]
["PCJ6.3.1.3/2025","Fomentar a adequação das redes de monitoramento","Contratação de 01 plano integrado de monitoramento",0,null,1,null,0,null,0,null,"Previsão de início em 2025 e conclusão em 2025"]
["PCJ6.3.1.6/2026","Integrar dados de monitoramento quali-quantitativos","Contratação de plano integrado de monitoramento",0,null,0,null,1,null,0,null,"Previsão de início em 2026 e conclusão em 2026"]
["PCJ6.3.2.2/2025","Apoio à gestão administrativa da Fundação da Agência da Bacia Hidrográfica dos Rios Sorocaba e Médio Tietê","Apoio prestado",0,null,1,null,1,null,1,null,"Apoio com gerenciadora contratada em 2025, podendo ser mantida para os próximos anos"]
["PCJ6.3.1.1/2025","Discutir a possibilidade de implantação de agências de bacia","Realização de um estudo sobre a implantação de agências de bacia",0,null,1,null,0,null,0,null,"Previsão de início em 2025 e conclusão em 2025"]
["PCJ3.3.1.1/2024","Substituição de sistemas rudimentares de tratamento de esgoto (fossa negra) por sistemas mais eficientes","Substituição de 30 sistemas ",0,null,0,null,0,null,30,null,"Está previsto início das contratações para 2024 com início da execução em 2025."]
["PCJ1.1.1.4/2024","Elaboração de projetos de ampliação e melhoria dos sistemas de transporte de esgotos","Elaboração de ao menos 01 projeto",0,null,0,null,0,null,1,null,"Está previsto início das contratações para 2024 com conclusão em 2027"]
["PCJ1.1.2.3/2024","Elaboração de projetos para a implantação de novas ETEs visando tratamento secundário","Elaboração de ao menos 01 projeto",0,null,0,null,0,null,1,null,"Está previsto início das contratações para 2024 com conclusão em 2027"]
["PCJ1.2.1.2/2024","Elaboração de projetos de melhorias da eficiência das ETEs na remoção de nutrientes","Elaboração de ao menos 01 projeto",0,null,0,null,0,null,1,null,"Está previsto início das contratações para 2024 com conclusão em 2027"]
["PCJ1.2.2.2/2027","Elaboração de projetos de implantação de tecnologias de desinfecção de efluentes domésticos","Elaboração de ao menos 01 projeto por ano",0,null,0,null,0,null,0,null,"Previsão de início em 2027 e execução em 2028"]
["PCJ3.1.2.3/2024","Incentivo à proteção das áreas sujeitas à restrição de uso","Implementação da RAP-PCJ; \nDisponibilização e atualização de dados e informações sobre áreas protegidas nas Bacias PCJ;\nElaboração de diagnóstico com a mensuração dos benefícios hídricos das áreas protegidas.",0,null,0,null,0,null,0,null,"Inicialmente sem recurso previsto para o quadriênio - Aguardando desdobramentos junto aos Comitês PCJ"]
["PCJ2.3.2.2/2024","Controle de perdas em sistemas de abastecimento de água","Alcance das metas intermediárias dos cenários de referência para planejamento, conforme descrito no  Plano de Bacias",0,null,0,null,"Os municípios que receberam investimentos deverão alcancar as metas intermediárias previstas pelo PBH para o ano de 2025",null,0,null,"Para fins de acompanhamento foi adotado como ano para verificação das metas intermediárias o ano de 2026"]
["PCJ5.2.2.1/2024","Elaboração de propostas para órgãos de financiamento em pesquisas","Propostas de linhas de fomento encaminhadas para órgãos de financiamento de pesquisas.",0,null,0,null,0,null,0,null,"Inicialmente sem recurso previsto para o quadriênio - Aguardando desdobramentos junto aos Comitês PCJ"]
["PCJ5.2.2.3/2024","Apoio ao desenvolvimento e difusão de pesquisas e tecnologias que contribuam no enfrentamento dos desafios identificados no Plano das Bacias PCJ","1 parcerias ou convênios firmados até 2027",0,null,0,null,0,null,0,null,"Inicialmente sem recurso previsto para o quadriênio - Aguardando desdobramentos junto aos Comitês PCJ"]
["PCJ6.2.5.2/2027","Apoio à regularização de outorga na área rural","Campanhas de divulgação realizadas e suporte técnico fornecido",0,null,0,null,0,null,1,null,"Previsão de início e conclusão em 2027"]
["PCJ1.1.1.1/2024","Elaboração de estudos para ampliação e melhoria dos sistemas de coleta de esgotos","Elaboração de ao menos 01 estudo",0,null,0,null,0,null,0,null,"Inicialmente sem recurso previsto para o quadriênio - Aguardando desdobramentos junto aos Comitês PCJ"]
["PCJ2.2.3.1/2024","Acompanhamento e apoio aos estudos de viabilidade, projetos de engenharia e licenciamento ambiental das barragens de Pedreira, Duas Pontes e do ribeirão Piraí e do trecho Oeste do SAR","Criação de GT para acompanhamento",0,null,0,null,1,null,0,null,"Cobrança Federal"]
["PCJ2.3.3.1/2024","Elaboração de um guia de manejo de drenagem e manejo de águas pluviais","01 Manual elaborado",1,null,0,null,0,null,0,null,"Cobrança Federal"]
["PCJ1.3.1.2/2025","Elaboração de estudo piloto para avaliação da carga difusa de origem urbana e rural afluente nos corpos hídricos das Bacias PCJ","01 estudo elaborado",0,null,1,null,0,null,0,null,"Cobrança Federal"]
["PCJ6.2.5.3/2024","Apoio operacional para fiscalização de outorgas","Apoio operacional contínuo",1,null,1,null,0,null,0,null,"Cobrança Federal "]
["PCJ6.1.1.2/2024","Apoio operacional para a área de cobrança pelo uso dos recursos hídricos","Apoio operacional contínuo",1,null,1,null,0,null,0,null,"Cobrança Federal "]
["PCJ6.1.1.5/2024","Apoio operacional para acompanhamento de projetos da área de Sistema de Informações ","Apoio operacional contínuo",1,null,1,null,0,null,0,null,"Cobrança Federal "]
["PCJ6.2.3.1/2024","Expansão, integração, operação e manutenção da rede de monitoramento quali-quantitativo dos recursos hídricos","Disponibilização de dados de ao menos 36 postos ativos",36,null,36,null,0,null,0,null,"Cobrança Federal "]
["PCJ2.1.1.1/2024","Manutenção e aprimoramento de um modelo chuva-vazão para as Bacias PCJ","Disponibilidade de ao menos 01 modelo",1,null,1,null,0,null,0,null,"Cobrança Federal "]
["PCJ2.1.2.1/2025","Aprimoramento de modelo de simulação hidrodinâmica do tempo de trânsito e do amortecimento da vazão preferencialmente à jusante do Sistema Cantareira","01 modelo calibrado",0,null,1,null,0,null,0,null,"Cobrança Federal "]
["PCJ6.2.6.1/2024","Apoio operacional para gerenciamento da implementação e da revisão do Plano de Bacias","Contratação de ao menos 01 pessoa",1,null,1,null,0,null,0,null,"Cobrança Federal "]
["PCJ6.1.1.4/2024","Apoio Operacional para acompanhamento de empreendimentos de demanda espontânea","Remuneração de agentes técnicos e financeiros para empreendimentos deliberados pelos Comitês PCJ",1,null,1,null,0,null,0,null,"Cobrança Federal "]
["PCJ6.1.2.2/2024","Remuneração de agentes técnicos e financeiros para empreendimentos deliberados pelos Comitês PCJ","Desembolso de ao menos 50% do valor previsto",3.5999999999999997E-2,null,3.5999999999999997E-2,null,3.5999999999999997E-2,null,3.5999999999999997E-2,null,"Cobrança Federal - Meta definida de acordo com horizonte previsto pelo PBH PCJ (15 anos)"]
["PCJ6.1.2.3/2024","Logística de Suporte às reuniões Plenárias e das CTs dos Comitês PCJ","Apoio operacional contínuo",1,null,1,null,0,null,0,null,"Cobrança Federal "]
["PCJ6.1.2.1/2024","Apoio operacional para a Secretaria Executiva dos Comitês PCJ","Apoio operacional contínuo",1,null,1,null,0,null,0,null,"Cobrança Federal "]
["PCJ6.1.1.7/2024","Apoio operacional para acompanhamento de ações da porção mineira","Apoio operacional contínuo",1,null,1,null,0,null,0,null,"Cobrança Federal "]
["PCJ6.1.1.1/2024","Apoio operacional para a Área de Tecnologia da Informação - TI","Apoio operacional contínuo",1,null,1,null,0,null,0,null,"Cobrança Federal "]
["PCJ6.1.2.4/2024","Participação de membros dos Comitês PCJ em eventos internos das CTs e eventos externos","Apoio operacional contínuo",1,null,1,null,0,null,0,null,"Cobrança Federal "]
["PCJ6.1.2.5/2024","Manutenção de licenciamento de sistemas de TI","Apoio operacional contínuo",1,null,1,null,0,null,0,null,"Cobrança Federal "]
["PCJ1.2.2.3/2024","Implantação das tecnologias de desinfecção projetadas","Ao menos 01 melhoria implantada",0,null,0,null,0,null,1,null,"Previsão de início em 2024 e conclusão em 2029"]
["PCJ1.1.2.5/2024","Implantação das ETEs projetadas e melhorias das ETEs existentes","Ao menos 01  ETE implantada",0,null,0,null,0,null,1,null,"Previsão de início em 2024 e conclusão em 2029"]
["PCJ1.2.1.9/2024","Implantação das melhorias das ETEs projetadas e retrofit de ETEs para remoção de nutrientes","Ao menos 01 melhoria implantada",0,null,0,null,0,null,1,null,"Previsão de início em 2024 e conclusão em 2029"]
["PCJ1.2.1.8/2024","Implantação de Unidades de Tratamento de Lodo nas ETAs","Ao menos 01 UTLs implantada em ETA",0,null,0,null,0,null,1,null,"Previsão de início das contratações em 2024 e 2025 e conclusão em 2027"]
["PCJ1.1.1.3/2024","Elaboração de projetos de ampliação e melhoria dos sistemas de coleta de esgotos","Elaboração de ao menos 01 projeto",0,null,0,null,0,null,0,null,"Inicialmente sem recurso previsto para o quadriênio - Aguardando desdobramentos junto aos Comitês PCJ"]
["PCJ1.1.1.5/2024","Ampliações e melhoria dos sistemas de coleta de esgotos","Ampliação dos sistemas de coleta de esgotos de pelo menos 20% dos municípios prioritários",0,null,0,null,0,null,0,null,"Meta prevista pelo PBH para 2035. Esse tipo de meta pode se alcançada sem relação direta com investimento do CBH."]
["PCJ1.3.2.1/2024","Elaboração de projetos demonstrativos para contenção de cargas difusas de origem rural e urbana","Estudo elaborado até final de 2025",0,null,0,null,0,null,0,null,"Inicialmente sem recurso previsto para o quadriênio - Aguardando desdobramentos junto aos Comitês PCJ"]
["PCJ1.3.2.3/2024","Implantação de medidas de contenção de cargas difusas de origem rural e urbana em locais prioritários","Todos os locais prioritários contemplados com as medidas propostas de mitigação da poluição difusa de maneira contínua até o fim de 2035",0,null,0,null,0,null,0,null,"Inicialmente sem recurso previsto para o quadriênio - Aguardando desdobramentos junto aos Comitês PCJ"]
["PCJ3.1.2.5/2024","Estabilização de voçorocas nas propriedades que receberão projetos de recomposição florestal (fonte: PDRF)","Estabilização de ao menos 10 voçorocas/ano nas propriedades que recebem projetos de recomposição florestal",0,null,0,null,0,null,0,null,"Inicialmente sem recurso previsto para o quadriênio - Aguardando desdobramentos junto aos Comitês PCJ"]
["PCJ6.1.1.3/2024","Apoio operacional para acompanhamento de projetos de assessoria ambiental","Apoio operacional contínuo",1,null,1,null,0,null,0,null,"Cobrança Federal "]
["PCJ3.1.2.1/2024","Promoção da conservação e recuperação de nascentes, matas ciliares e áreas de recarga","Recuperação de 40 hectares de áreas prioritárias por ano",40,null,40,null,0,null,0,null,"Cobrança Federal "]
["PCJ3.1.3.1/2024","Implementação de projetos de PSA","Contratação de ao menos 01 projeto aprovado no Edital anualmente",0,null,0,null,0,null,0,null,"Cobrança Federal "]
["PCJ3.1.1.1/2024","Desenvolvimento e monitoramento da implementação dos PIPs","Contratação da elaboração de PIPs para 1.000 hectares por ano",1000,null,1000,null,0,null,0,null,"Cobrança Federal "]
["PCJ5.3.1.2/2024","Elaboração de um Plano de Capacitação Técnica e realização de processos formativos nas áreas de atuação das Câmaras Técnicas","01 Plano elaborado e ao menos 12 membros capacitados em nível de pós-graduação",12,null,12,null,0,null,0,null,"Cobrança Federal "]
["PCJ1.4.1.2/2024","Ampliação e divulgação do programa de capacitação (Escola da Água e Saneamento), fomento e incentivo à capacitação de operadores","Capacitação de ao menos 05 turmas por ano",5,null,5,null,0,null,0,null,"Cobrança Federal "]
["PCJ5.2.1.2/2024","Realização de processos formativos e campanhas educativas sobre a realidade das Bacias PCJ","Ao menos 01 processo formativo e uma campanha educativa realizada",0,null,0,null,1,null,0,null,"Cobrança Federal "]
["PCJ5.1.1.1/2024","Elaboração e execução de um Plano de Comunicação para o fortalecimento da comunicação entre a sociedade civil e os Comitês PCJ","01 Plano elaborado e ações implementadas",0,null,0,null,1,null,0,null,"Cobrança Federal "]
["PCJ6.1.1.6/2024","Apoio operacional para a área de comunicação social","Apoio operacional contínuo",1,null,1,null,0,null,0,null,"Cobrança Federal "]
["PCJ5.2.1.3/2024","Elaboração e divulgação de materiais educativos","Materiais educativos elaborados e distribuídos, conforme planejado pelo plano de comunicação.",0,null,0,null,"Materiais educativos elaborados",null,0,null,"Cobrança Federal "]

{"sheet":"Acomp. financeiro  24-27","index":3,"n_rows":100,"n_cols":17,"rows_kept":100,"cut":false,"hidden":false,"merged":[]}
["id_ação_Fonte_oculta","ID Ação","Descrição da ação","Fonte","R$  Planejado (2024)","R$  Disponibilizado (2024)","R$  Executado (2024)","R$  Planejado (2025)","R$  Disponibilizado (2025)","R$  Executado (2025)","R$  Planejado (2026)","R$  Disponibilizado (2026)","R$  Executado (2026)","R$  Planejado (2027)","R$  Disponibilizado (2027)","R$  Executado (2027)","Observações sobre execução financeira da meta"]
[{"$f":"Financeiro[[#This Row],[ID Ação]]&Financeiro[[#This Row],[Fonte]]","v":"PCJ3.3.1.2/2024FEHIDRO - Cobrança estadual"},{"$f":"IFERROR(INDEX(IdentAcoes[ID Ação],MATCH(0,INDEX(--(COUNTIF(B$1:B1,IdentAcoes[ID Ação])=IdentAcoes[[Quantidade de fontes de recursos ]]),0),0)),\"\")","v":"PCJ3.3.1.2/2024"},{"$f":"IFERROR(INDEX(IdentAcoes[Descrição da ação],MATCH(0,INDEX(--(COUNTIF(C$1:C1,IdentAcoes[Descrição da ação])=IdentAcoes[[Quantidade de fontes de recursos ]]),0),0)),\"\")","v":"Fomento a Planos Municipais de Saneamento Rural"},"FEHIDRO - Cobrança estadual",1000000,null,null,2000000,null,null,1000000,null,null,1341614.1282998323]
[{"$f":"Financeiro[[#This Row],[ID Ação]]&Financeiro[[#This Row],[Fonte]]","v":"PCJ3.3.1.2/2024FEHIDRO - CFURH"},{"$f":"IFERROR(INDEX(IdentAcoes[ID Ação],MATCH(0,INDEX(--(COUNTIF(B$1:B2,IdentAcoes[ID Ação])=IdentAcoes[[Quantidade de fontes de recursos ]]),0),0)),\"\")","v":"PCJ3.3.1.2/2024"},{"$f":"IFERROR(INDEX(IdentAcoes[Descrição da ação],MATCH(0,INDEX(--(COUNTIF(C$1:C2,IdentAcoes[Descrição da ação])=IdentAcoes[[Quantidade de fontes de recursos ]]),0),0)),\"\")","v":"Fomento a Planos Municipais de Saneamento Rural"},"FEHIDRO - CFURH",822566.3,null,null,861129.6,null,null,901617,null,null,944164]
[{"$f":"Financeiro[[#This Row],[ID Ação]]&Financeiro[[#This Row],[Fonte]]","v":"PCJ2.3.1.1/2024FEHIDRO - Cobrança estadual"},{"$f":"IFERROR(INDEX(IdentAcoes[ID Ação],MATCH(0,INDEX(--(COUNTIF(B$1:B3,IdentAcoes[ID Ação])=IdentAcoes[[Quantidade de fontes de recursos ]]),0),0)),\"\")","v":"PCJ2.3.1.1/2024"},{"$f":"IFERROR(INDEX(IdentAcoes[Descrição da ação],MATCH(0,INDEX(--(COUNTIF(C$1:C3,IdentAcoes[Descrição da ação])=IdentAcoes[[Quantidade de fontes de recursos ]]),0),0)),\"\")","v":"Estudos de viabilidade para aumento de regularização de vazões em mananciais existentes e novos barramentos"},"FEHIDRO - Cobrança estadual",1000000,null,null,1500000,null,null,500000,null,null,500000]
[{"$f":"Financeiro[[#This Row],[ID Ação]]&Financeiro[[#This Row],[Fonte]]","v":"PCJ2.3.3.2/2024FEHIDRO - Cobrança estadual"},{"$f":"IFERROR(INDEX(IdentAcoes[ID Ação],MATCH(0,INDEX(--(COUNTIF(B$1:B4,IdentAcoes[ID Ação])=IdentAcoes[[Quantidade de fontes de recursos ]]),0),0)),\"\")","v":"PCJ2.3.3.2/2024"},{"$f":"IFERROR(INDEX(IdentAcoes[Descrição da ação],MATCH(0,INDEX(--(COUNTIF(C$1:C4,IdentAcoes[Descrição da ação])=IdentAcoes[[Quantidade de fontes de recursos ]]),0),0)),\"\")","v":"Elaboração dos Planos Diretores de Drenagem Urbana e Manejo de Águas Pluviais"},"FEHIDRO - Cobrança estadual",1500000,null,null,1500000,null,null,1000000,null,null,1000000]
[{"$f":"Financeiro[[#This Row],[ID Ação]]&Financeiro[[#This Row],[Fonte]]","v":"PCJ1.2.1.5/2024FEHIDRO - Cobrança estadual"},{"$f":"IFERROR(INDEX(IdentAcoes[ID Ação],MATCH(0,INDEX(--(COUNTIF(B$1:B5,IdentAcoes[ID Ação])=IdentAcoes[[Quantidade de fontes de recursos ]]),0),0)),\"\")","v":"PCJ1.2.1.5/2024"},{"$f":"IFERROR(INDEX(IdentAcoes[Descrição da ação],MATCH(0,INDEX(--(COUNTIF(C$1:C5,IdentAcoes[Descrição da ação])=IdentAcoes[[Quantidade de fontes de recursos ]]),0),0)),\"\")","v":"Cadastro, caracterização e modelagem de cargas industriais"},"FEHIDRO - Cobrança estadual",2000000,null,null,0,null,null,0,null,null,0]
[{"$f":"Financeiro[[#This Row],[ID Ação]]&Financeiro[[#This Row],[Fonte]]","v":"PCJ1.2.1.6/2026FEHIDRO - Cobrança estadual"},{"$f":"IFERROR(INDEX(IdentAcoes[ID Ação],MATCH(0,INDEX(--(COUNTIF(B$1:B6,IdentAcoes[ID Ação])=IdentAcoes[[Quantidade de fontes de recursos ]]),0),0)),\"\")","v":"PCJ1.2.1.6/2026"},{"$f":"IFERROR(INDEX(IdentAcoes[Descrição da ação],MATCH(0,INDEX(--(COUNTIF(C$1:C6,IdentAcoes[Descrição da ação])=IdentAcoes[[Quantidade de fontes de recursos ]]),0),0)),\"\")","v":"Estudos de alternativas de diminuição da carga industrial"},"FEHIDRO - Cobrança estadual",0,null,null,0,null,null,513285.71999999764,null,null,0]
[{"$f":"Financeiro[[#This Row],[ID Ação]]&Financeiro[[#This Row],[Fonte]]","v":"PCJ1.2.2.1/2026FEHIDRO - Cobrança estadual"},{"$f":"IFERROR(INDEX(IdentAcoes[ID Ação],MATCH(0,INDEX(--(COUNTIF(B$1:B7,IdentAcoes[ID Ação])=IdentAcoes[[Quantidade de fontes de recursos ]]),0),0)),\"\")","v":"PCJ1.2.2.1/2026"},{"$f":"IFERROR(INDEX(IdentAcoes[Descrição da ação],MATCH(0,INDEX(--(COUNTIF(C$1:C7,IdentAcoes[Descrição da ação])=IdentAcoes[[Quantidade de fontes de recursos ]]),0),0)),\"\")","v":"Elaboração de estudos sobre os impactos da cloração de efluentes nos mananciais"},"FEHIDRO - Cobrança estadual",0,null,null,0,null,null,700000,null,null,0]
[{"$f":"Financeiro[[#This Row],[ID Ação]]&Financeiro[[#This Row],[Fonte]]","v":"PCJ1.3.1.1/2027FEHIDRO - Cobrança estadual"},{"$f":"IFERROR(INDEX(IdentAcoes[ID Ação],MATCH(0,INDEX(--(COUNTIF(B$1:B8,IdentAcoes[ID Ação])=IdentAcoes[[Quantidade de fontes de recursos ]]),0),0)),\"\")","v":"PCJ1.3.1.1/2027"},{"$f":"IFERROR(INDEX(IdentAcoes[Descrição da ação],MATCH(0,INDEX(--(COUNTIF(C$1:C8,IdentAcoes[Descrição da ação])=IdentAcoes[[Quantidade de fontes de recursos ]]),0),0)),\"\")","v":"Elaboração de estudo do background de fósforo nos corpos hídricos das Bacias PCJ e integração no SSD"},"FEHIDRO - Cobrança estadual",0,null,null,0,null,null,0,null,null,1707385.8717001672]
[{"$f":"Financeiro[[#This Row],[ID Ação]]&Financeiro[[#This Row],[Fonte]]","v":"PCJ1.3.1.3/2026FEHIDRO - Cobrança estadual"},{"$f":"IFERROR(INDEX(IdentAcoes[ID Ação],MATCH(0,INDEX(--(COUNTIF(B$1:B9,IdentAcoes[ID Ação])=IdentAcoes[[Quantidade de fontes de recursos ]]),0),0)),\"\")","v":"PCJ1.3.1.3/2026"},{"$f":"IFERROR(INDEX(IdentAcoes[Descrição da ação],MATCH(0,INDEX(--(COUNTIF(C$1:C9,IdentAcoes[Descrição da ação])=IdentAcoes[[Quantidade de fontes de recursos ]]),0),0)),\"\")","v":"Elaboração de estudo sobre estruturas de controle e redução de cargas difusas e definição de metodologia para identificação e priorização de áreas potencialmente afetadas por cargas difusas de origem rural e urbana"},"FEHIDRO - Cobrança estadual",0,null,null,0,null,null,2700000,null,null,0]
[{"$f":"Financeiro[[#This Row],[ID Ação]]&Financeiro[[#This Row],[Fonte]]","v":"PCJ1.3.2.2/2026FEHIDRO - Cobrança estadual"},{"$f":"IFERROR(INDEX(IdentAcoes[ID Ação],MATCH(0,INDEX(--(COUNTIF(B$1:B10,IdentAcoes[ID Ação])=IdentAcoes[[Quantidade de fontes de recursos ]]),0),0)),\"\")","v":"PCJ1.3.2.2/2026"},{"$f":"IFERROR(INDEX(IdentAcoes[Descrição da ação],MATCH(0,INDEX(--(COUNTIF(C$1:C10,IdentAcoes[Descrição da ação])=IdentAcoes[[Quantidade de fontes de recursos ]]),0),0)),\"\")","v":"Elaboração de um Plano de Contenção de Cargas Difusas em locais prioritários nas Bacias PCJ"},"FEHIDRO - Cobrança estadual",0,null,null,0,null,null,2000000,null,null,0]
[{"$f":"Financeiro[[#This Row],[ID Ação]]&Financeiro[[#This Row],[Fonte]]","v":"PCJ6.3.2.1/2025FEHIDRO - Cobrança estadual"},{"$f":"IFERROR(INDEX(IdentAcoes[ID Ação],MATCH(0,INDEX(--(COUNTIF(B$1:B11,IdentAcoes[ID Ação])=IdentAcoes[[Quantidade de fontes de recursos ]]),0),0)),\"\")","v":"PCJ6.3.2.1/2025"},{"$f":"IFERROR(INDEX(IdentAcoes[Descrição da ação],MATCH(0,INDEX(--(COUNTIF(C$1:C11,IdentAcoes[Descrição da ação])=IdentAcoes[[Quantidade de fontes de recursos ]]),0),0)),\"\")","v":"Estudo para articulação entre CBHs visando a pactuação de condições de entrega"},"FEHIDRO - Cobrança estadual",0,null,null,600000,null,null,0,null,null,0]
[{"$f":"Financeiro[[#This Row],[ID Ação]]&Financeiro[[#This Row],[Fonte]]","v":"PCJ1.1.1.2/2025FEHIDRO - Cobrança estadual"},{"$f":"IFERROR(INDEX(IdentAcoes[ID Ação],MATCH(0,INDEX(--(COUNTIF(B$1:B12,IdentAcoes[ID Ação])=IdentAcoes[[Quantidade de fontes de recursos ]]),0),0)),\"\")","v":"PCJ1.1.1.2/2025"},{"$f":"IFERROR(INDEX(IdentAcoes[Descrição da ação],MATCH(0,INDEX(--(COUNTIF(C$1:C12,IdentAcoes[Descrição da ação])=IdentAcoes[[Quantidade de fontes de recursos ]]),0),0)),\"\")","v":"Elaboração de estudos para ampliação e melhoria dos sistemas de transporte de esgotos"},"FEHIDRO - Cobrança estadual",0,null,null,1000000,null,null,1000000,null,null,1000000]
[{"$f":"Financeiro[[#This Row],[ID Ação]]&Financeiro[[#This Row],[Fonte]]","v":"PCJ1.1.2.2/2025FEHIDRO - Cobrança estadual"},{"$f":"IFERROR(INDEX(IdentAcoes[ID Ação],MATCH(0,INDEX(--(COUNTIF(B$1:B13,IdentAcoes[ID Ação])=IdentAcoes[[Quantidade de fontes de recursos ]]),0),0)),\"\")","v":"PCJ1.1.2.2/2025"},{"$f":"IFERROR(INDEX(IdentAcoes[Descrição da ação],MATCH(0,INDEX(--(COUNTIF(C$1:C13,IdentAcoes[Descrição da ação])=IdentAcoes[[Quantidade de fontes de recursos ]]),0),0)),\"\")","v":"Elaboração de estudos para a implantação de novas ETEs visando tratamento secundário"},"FEHIDRO - Cobrança estadual",0,null,null,1000000,null,null,750000,null,null,700000]
[{"$f":"Financeiro[[#This Row],[ID Ação]]&Financeiro[[#This Row],[Fonte]]","v":"PCJ1.2.1.1/2025FEHIDRO - Cobrança estadual"},{"$f":"IFERROR(INDEX(IdentAcoes[ID Ação],MATCH(0,INDEX(--(COUNTIF(B$1:B14,IdentAcoes[ID Ação])=IdentAcoes[[Quantidade de fontes de recursos ]]),0),0)),\"\")","v":"PCJ1.2.1.1/2025"},{"$f":"IFERROR(INDEX(IdentAcoes[Descrição da ação],MATCH(0,INDEX(--(COUNTIF(C$1:C14,IdentAcoes[Descrição da ação])=IdentAcoes[[Quantidade de fontes de recursos ]]),0),0)),\"\")","v":"Elaboração de estudos de melhorias da eficiência das ETEs na remoção de nutrientes"},"FEHIDRO - Cobrança estadual",0,null,null,1000000,null,null,1000000,null,null,1500000]
[{"$f":"Financeiro[[#This Row],[ID Ação]]&Financeiro[[#This Row],[Fonte]]","v":"PCJ1.1.2.4/2024FEHIDRO - Cobrança estadual"},{"$f":"IFERROR(INDEX(IdentAcoes[ID Ação],MATCH(0,INDEX(--(COUNTIF(B$1:B15,IdentAcoes[ID Ação])=IdentAcoes[[Quantidade de fontes de recursos ]]),0),0)),\"\")","v":"PCJ1.1.2.4/2024"},{"$f":"IFERROR(INDEX(IdentAcoes[Descrição da ação],MATCH(0,INDEX(--(COUNTIF(C$1:C15,IdentAcoes[Descrição da ação])=IdentAcoes[[Quantidade de fontes de recursos ]]),0),0)),\"\")","v":"Elaboração de estudos e relatórios visando o licenciamento das ETEs projetadas"},"FEHIDRO - Cobrança estadual",0,null,null,0,null,null,0,null,null,0]
[{"$f":"Financeiro[[#This Row],[ID Ação]]&Financeiro[[#This Row],[Fonte]]","v":"PCJ1.2.1.7/2024FEHIDRO - Cobrança estadual"},{"$f":"IFERROR(INDEX(IdentAcoes[ID Ação],MATCH(0,INDEX(--(COUNTIF(B$1:B16,IdentAcoes[ID Ação])=IdentAcoes[[Quantidade de fontes de recursos ]]),0),0)),\"\")","v":"PCJ1.2.1.7/2024"},{"$f":"IFERROR(INDEX(IdentAcoes[Descrição da ação],MATCH(0,INDEX(--(COUNTIF(C$1:C16,IdentAcoes[Descrição da ação])=IdentAcoes[[Quantidade de fontes de recursos ]]),0),0)),\"\")","v":"Elaboração e revisão de planos municipais de saneamento básico"},"FEHIDRO - Cobrança estadual",2500000,null,null,1750000,null,null,1750000,null,null,1750000]
[{"$f":"Financeiro[[#This Row],[ID Ação]]&Financeiro[[#This Row],[Fonte]]","v":"PCJ2.3.2.1/2024FEHIDRO - Cobrança estadual"},{"$f":"IFERROR(INDEX(IdentAcoes[ID Ação],MATCH(0,INDEX(--(COUNTIF(B$1:B17,IdentAcoes[ID Ação])=IdentAcoes[[Quantidade de fontes de recursos ]]),0),0)),\"\")","v":"PCJ2.3.2.1/2024"},{"$f":"IFERROR(INDEX(IdentAcoes[Descrição da ação],MATCH(0,INDEX(--(COUNTIF(C$1:C17,IdentAcoes[Descrição da ação])=IdentAcoes[[Quantidade de fontes de recursos ]]),0),0)),\"\")","v":"Elaboração e revisão de Planos de Controle e Redução de Perdas"},"FEHIDRO - Cobrança estadual",1500000,null,null,1750000,null,null,1250000,null,null,1250000]
[{"$f":"Financeiro[[#This Row],[ID Ação]]&Financeiro[[#This Row],[Fonte]]","v":"PCJ2.2.4.1/2024FEHIDRO - Cobrança estadual"},{"$f":"IFERROR(INDEX(IdentAcoes[ID Ação],MATCH(0,INDEX(--(COUNTIF(B$1:B18,IdentAcoes[ID Ação])=IdentAcoes[[Quantidade de fontes de recursos ]]),0),0)),\"\")","v":"PCJ2.2.4.1/2024"},{"$f":"IFERROR(INDEX(IdentAcoes[Descrição da ação],MATCH(0,INDEX(--(COUNTIF(C$1:C18,IdentAcoes[Descrição da ação])=IdentAcoes[[Quantidade de fontes de recursos ]]),0),0)),\"\")","v":"Desenvolvimento de estudo de alternativas de aumento da disponibilidade hídrica nas sub-bacias dos rios Atibaia, Jundiaí e Capivari"},"FEHIDRO - Cobrança estadual",1500000,null,null,0,null,null,0,null,null,0]
[{"$f":"Financeiro[[#This Row],[ID Ação]]&Financeiro[[#This Row],[Fonte]]","v":"PCJ4.2.1.1/2026FEHIDRO - Cobrança estadual"},{"$f":"IFERROR(INDEX(IdentAcoes[ID Ação],MATCH(0,INDEX(--(COUNTIF(B$1:B19,IdentAcoes[ID Ação])=IdentAcoes[[Quantidade de fontes de recursos ]]),0),0)),\"\")","v":"PCJ4.2.1.1/2026"},{"$f":"IFERROR(INDEX(IdentAcoes[Descrição da ação],MATCH(0,INDEX(--(COUNTIF(C$1:C19,IdentAcoes[Descrição da ação])=IdentAcoes[[Quantidade de fontes de recursos ]]),0),0)),\"\")","v":"Desenvolver estudo regional hidrogeológico nas Bacias PCJ"},"FEHIDRO - Cobrança estadual",0,null,null,0,null,null,2000000,null,null,0]
[{"$f":"Financeiro[[#This Row],[ID Ação]]&Financeiro[[#This Row],[Fonte]]","v":"PCJ4.2.1.2/2026FEHIDRO - Cobrança estadual"},{"$f":"IFERROR(INDEX(IdentAcoes[ID Ação],MATCH(0,INDEX(--(COUNTIF(B$1:B20,IdentAcoes[ID Ação])=IdentAcoes[[Quantidade de fontes de recursos ]]),0),0)),\"\")","v":"PCJ4.2.1.2/2026"},{"$f":"IFERROR(INDEX(IdentAcoes[Descrição da ação],MATCH(0,INDEX(--(COUNTIF(C$1:C20,IdentAcoes[Descrição da ação])=IdentAcoes[[Quantidade de fontes de recursos ]]),0),0)),\"\")","v":"Desenvolvimento de estudo para estimativa de balanços hídricos e recargas nas Bacias PCJ"},"FEHIDRO - Cobrança estadual",0,null,null,0,null,null,2250000,null,null,0]
[{"$f":"Financeiro[[#This Row],[ID Ação]]&Financeiro[[#This Row],[Fonte]]","v":"PCJ4.2.1.3/2027FEHIDRO - Cobrança estadual"},{"$f":"IFERROR(INDEX(IdentAcoes[ID Ação],MATCH(0,INDEX(--(COUNTIF(B$1:B21,IdentAcoes[ID Ação])=IdentAcoes[[Quantidade de fontes de recursos ]]),0),0)),\"\")","v":"PCJ4.2.1.3/2027"},{"$f":"IFERROR(INDEX(IdentAcoes[Descrição da ação],MATCH(0,INDEX(--(COUNTIF(C$1:C21,IdentAcoes[Descrição da ação])=IdentAcoes[[Quantidade de fontes de recursos ]]),0),0)),\"\")","v":"Delimitar as principais áreas de recarga e estabelecer diretrizes de proteção"},"FEHIDRO - Cobrança estadual",0,null,null,0,null,null,0,null,null,2550000]
[{"$f":"Financeiro[[#This Row],[ID Ação]]&Financeiro[[#This Row],[Fonte]]","v":"PCJ4.2.2.1/2027FEHIDRO - Cobrança estadual"},{"$f":"IFERROR(INDEX(IdentAcoes[ID Ação],MATCH(0,INDEX(--(COUNTIF(B$1:B22,IdentAcoes[ID Ação])=IdentAcoes[[Quantidade de fontes de recursos ]]),0),0)),\"\")","v":"PCJ4.2.2.1/2027"},{"$f":"IFERROR(INDEX(IdentAcoes[Descrição da ação],MATCH(0,INDEX(--(COUNTIF(C$1:C22,IdentAcoes[Descrição da ação])=IdentAcoes[[Quantidade de fontes de recursos ]]),0),0)),\"\")","v":"Elaboração do estudo hidrogeológico do aquífero Tubarão"},"FEHIDRO - Cobrança estadual",0,null,null,0,null,null,0,null,null,1200000]
[{"$f":"Financeiro[[#This Row],[ID Ação]]&Financeiro[[#This Row],[Fonte]]","v":"PCJ6.3.1.4/2025FEHIDRO - Cobrança estadual"},{"$f":"IFERROR(INDEX(IdentAcoes[ID Ação],MATCH(0,INDEX(--(COUNTIF(B$1:B23,IdentAcoes[ID Ação])=IdentAcoes[[Quantidade de fontes de recursos ]]),0),0)),\"\")","v":"PCJ6.3.1.4/2025"},{"$f":"IFERROR(INDEX(IdentAcoes[Descrição da ação],MATCH(0,INDEX(--(COUNTIF(C$1:C23,IdentAcoes[Descrição da ação])=IdentAcoes[[Quantidade de fontes de recursos ]]),0),0)),\"\")","v":"Estabelecer parcerias para pesquisa com universidade e institutos"},"FEHIDRO - Cobrança estadual",0,null,null,71428.56,null,null,0,null,null,0]
[{"$f":"Financeiro[[#This Row],[ID Ação]]&Financeiro[[#This Row],[Fonte]]","v":"PCJ4.1.1.2/2027FEHIDRO - Cobrança estadual"},{"$f":"IFERROR(INDEX(IdentAcoes[ID Ação],MATCH(0,INDEX(--(COUNTIF(B$1:B24,IdentAcoes[ID Ação])=IdentAcoes[[Quantidade de fontes de recursos ]]),0),0)),\"\")","v":"PCJ4.1.1.2/2027"},{"$f":"IFERROR(INDEX(IdentAcoes[Descrição da ação],MATCH(0,INDEX(--(COUNTIF(C$1:C24,IdentAcoes[Descrição da ação])=IdentAcoes[[Quantidade de fontes de recursos ]]),0),0)),\"\")","v":"Desenvolvimento de banco de dados de poços e suporte à decisão"},"FEHIDRO - Cobrança estadual",0,null,null,0,null,null,0,null,null,1500000]
[{"$f":"Financeiro[[#This Row],[ID Ação]]&Financeiro[[#This Row],[Fonte]]","v":"PCJ6.2.5.1/2024FEHIDRO - Cobrança estadual"},{"$f":"IFERROR(INDEX(IdentAcoes[ID Ação],MATCH(0,INDEX(--(COUNTIF(B$1:B25,IdentAcoes[ID Ação])=IdentAcoes[[Quantidade de fontes de recursos ]]),0),0)),\"\")","v":"PCJ6.2.5.1/2024"},{"$f":"IFERROR(INDEX(IdentAcoes[Descrição da ação],MATCH(0,INDEX(--(COUNTIF(C$1:C25,IdentAcoes[Descrição da ação])=IdentAcoes[[Quantidade de fontes de recursos ]]),0),0)),\"\")","v":"Desenvolvimento de um plano de fiscalização de Outorgas em apoio ao órgão gestor "},"FEHIDRO - Cobrança estadual",0,null,null,0,null,null,0,null,null,0]
[{"$f":"Financeiro[[#This Row],[ID Ação]]&Financeiro[[#This Row],[Fonte]]","v":"PCJ6.2.3.2/2026FEHIDRO - Cobrança estadual"},{"$f":"IFERROR(INDEX(IdentAcoes[ID Ação],MATCH(0,INDEX(--(COUNTIF(B$1:B26,IdentAcoes[ID Ação])=IdentAcoes[[Quantidade de fontes de recursos ]]),0),0)),\"\")","v":"PCJ6.2.3.2/2026"},{"$f":"IFERROR(INDEX(IdentAcoes[Descrição da ação],MATCH(0,INDEX(--(COUNTIF(C$1:C26,IdentAcoes[Descrição da ação])=IdentAcoes[[Quantidade de fontes de recursos ]]),0),0)),\"\")","v":"Monitoramento de chuva, vazão, qualidade e nível de água subterrânea em pequenas bacias hidrográficas"},"FEHIDRO - Cobrança estadual",0,null,null,0,null,null,1000000,null,null,1200000]
[{"$f":"Financeiro[[#This Row],[ID Ação]]&Financeiro[[#This Row],[Fonte]]","v":"PCJ6.2.3.3/2026FEHIDRO - Cobrança estadual"},{"$f":"IFERROR(INDEX(IdentAcoes[ID Ação],MATCH(0,INDEX(--(COUNTIF(B$1:B27,IdentAcoes[ID Ação])=IdentAcoes[[Quantidade de fontes de recursos ]]),0),0)),\"\")","v":"PCJ6.2.3.3/2026"},{"$f":"IFERROR(INDEX(IdentAcoes[Descrição da ação],MATCH(0,INDEX(--(COUNTIF(C$1:C27,IdentAcoes[Descrição da ação])=IdentAcoes[[Quantidade de fontes de recursos ]]),0),0)),\"\")","v":"Implantação, integração, operação e manutenção da rede de monitoramento quali-quantitativo das águas subterrâneas"},"FEHIDRO - Cobrança estadual",0,null,null,0,null,null,1000000,null,null,0]
[{"$f":"Financeiro[[#This Row],[ID Ação]]&Financeiro[[#This Row],[Fonte]]","v":"PCJ6.3.1.3/2025FEHIDRO - Cobrança estadual"},{"$f":"IFERROR(INDEX(IdentAcoes[ID Ação],MATCH(0,INDEX(--(COUNTIF(B$1:B28,IdentAcoes[ID Ação])=IdentAcoes[[Quantidade de fontes de recursos ]]),0),0)),\"\")","v":"PCJ6.3.1.3/2025"},{"$f":"IFERROR(INDEX(IdentAcoes[Descrição da ação],MATCH(0,INDEX(--(COUNTIF(C$1:C28,IdentAcoes[Descrição da ação])=IdentAcoes[[Quantidade de fontes de recursos ]]),0),0)),\"\")","v":"Fomentar a adequação das redes de monitoramento"},"FEHIDRO - Cobrança estadual",0,null,null,35714.28,null,null,0,null,null,0]
[{"$f":"Financeiro[[#This Row],[ID Ação]]&Financeiro[[#This Row],[Fonte]]","v":"PCJ6.3.1.6/2026FEHIDRO - Cobrança estadual"},{"$f":"IFERROR(INDEX(IdentAcoes[ID Ação],MATCH(0,INDEX(--(COUNTIF(B$1:B29,IdentAcoes[ID Ação])=IdentAcoes[[Quantidade de fontes de recursos ]]),0),0)),\"\")","v":"PCJ6.3.1.6/2026"},{"$f":"IFERROR(INDEX(IdentAcoes[Descrição da ação],MATCH(0,INDEX(--(COUNTIF(C$1:C29,IdentAcoes[Descrição da ação])=IdentAcoes[[Quantidade de fontes de recursos ]]),0),0)),\"\")","v":"Integrar dados de monitoramento quali-quantitativos"},"FEHIDRO - Cobrança estadual",0,null,null,0,null,null,35714.28,null,null,0]
[{"$f":"Financeiro[[#This Row],[ID Ação]]&Financeiro[[#This Row],[Fonte]]","v":"PCJ6.3.2.2/2025FEHIDRO - Cobrança estadual"},{"$f":"IFERROR(INDEX(IdentAcoes[ID Ação],MATCH(0,INDEX(--(COUNTIF(B$1:B30,IdentAcoes[ID Ação])=IdentAcoes[[Quantidade de fontes de recursos ]]),0),0)),\"\")","v":"PCJ6.3.2.2/2025"},{"$f":"IFERROR(INDEX(IdentAcoes[Descrição da ação],MATCH(0,INDEX(--(COUNTIF(C$1:C30,IdentAcoes[Descrição da ação])=IdentAcoes[[Quantidade de fontes de recursos ]]),0),0)),\"\")","v":"Apoio à gestão administrativa da Fundação da Agência da Bacia Hidrográfica dos Rios Sorocaba e Médio Tietê"},"FEHIDRO - Cobrança estadual",0,null,null,40000,null,null,0,null,null,0]
[{"$f":"Financeiro[[#This Row],[ID Ação]]&Financeiro[[#This Row],[Fonte]]","v":"PCJ6.3.1.1/2025FEHIDRO - Cobrança estadual"},{"$f":"IFERROR(INDEX(IdentAcoes[ID Ação],MATCH(0,INDEX(--(COUNTIF(B$1:B31,IdentAcoes[ID Ação])=IdentAcoes[[Quantidade de fontes de recursos ]]),0),0)),\"\")","v":"PCJ6.3.1.1/2025"},{"$f":"IFERROR(INDEX(IdentAcoes[Descrição da ação],MATCH(0,INDEX(--(COUNTIF(C$1:C31,IdentAcoes[Descrição da ação])=IdentAcoes[[Quantidade de fontes de recursos ]]),0),0)),\"\")","v":"Discutir a possibilidade de implantação de agências de bacia"},"FEHIDRO - Cobrança estadual",0,null,null,300000,null,null,0,null,null,0]
[{"$f":"Financeiro[[#This Row],[ID Ação]]&Financeiro[[#This Row],[Fonte]]","v":"PCJ3.3.1.1/2024FEHIDRO - Cobrança estadual"},{"$f":"IFERROR(INDEX(IdentAcoes[ID Ação],MATCH(0,INDEX(--(COUNTIF(B$1:B32,IdentAcoes[ID Ação])=IdentAcoes[[Quantidade de fontes de recursos ]]),0),0)),\"\")","v":"PCJ3.3.1.1/2024"},{"$f":"IFERROR(INDEX(IdentAcoes[Descrição da ação],MATCH(0,INDEX(--(COUNTIF(C$1:C32,IdentAcoes[Descrição da ação])=IdentAcoes[[Quantidade de fontes de recursos ]]),0),0)),\"\")","v":"Substituição de sistemas rudimentares de tratamento de esgoto (fossa negra) por sistemas mais eficientes"},"FEHIDRO - Cobrança estadual",2300000,null,null,2000000,null,null,1000000,null,null,1250000]
[{"$f":"Financeiro[[#This Row],[ID Ação]]&Financeiro[[#This Row],[Fonte]]","v":"PCJ1.1.1.4/2024FEHIDRO - Cobrança estadual"},{"$f":"IFERROR(INDEX(IdentAcoes[ID Ação],MATCH(0,INDEX(--(COUNTIF(B$1:B33,IdentAcoes[ID Ação])=IdentAcoes[[Quantidade de fontes de recursos ]]),0),0)),\"\")","v":"PCJ1.1.1.4/2024"},{"$f":"IFERROR(INDEX(IdentAcoes[Descrição da ação],MATCH(0,INDEX(--(COUNTIF(C$1:C33,IdentAcoes[Descrição da ação])=IdentAcoes[[Quantidade de fontes de recursos ]]),0),0)),\"\")","v":"Elaboração de projetos de ampliação e melhoria dos sistemas de transporte de esgotos"},"FEHIDRO - Cobrança estadual",2000000,null,null,1000000,null,null,650000,null,null,750000]
[{"$f":"Financeiro[[#This Row],[ID Ação]]&Financeiro[[#This Row],[Fonte]]","v":"PCJ1.1.2.3/2024FEHIDRO - Cobrança estadual"},{"$f":"IFERROR(INDEX(IdentAcoes[ID Ação],MATCH(0,INDEX(--(COUNTIF(B$1:B34,IdentAcoes[ID Ação])=IdentAcoes[[Quantidade de fontes de recursos ]]),0),0)),\"\")","v":"PCJ1.1.2.3/2024"},{"$f":"IFERROR(INDEX(IdentAcoes[Descrição da ação],MATCH(0,INDEX(--(COUNTIF(C$1:C34,IdentAcoes[Descrição da ação])=IdentAcoes[[Quantidade de fontes de recursos ]]),0),0)),\"\")","v":"Elaboração de projetos para a implantação de novas ETEs visando tratamento secundário"},"FEHIDRO - Cobrança estadual",1300000,null,null,1000000,null,null,750000,null,null,750000]
[{"$f":"Financeiro[[#This Row],[ID Ação]]&Financeiro[[#This Row],[Fonte]]","v":"PCJ1.2.1.2/2024FEHIDRO - Cobrança estadual"},{"$f":"IFERROR(INDEX(IdentAcoes[ID Ação],MATCH(0,INDEX(--(COUNTIF(B$1:B35,IdentAcoes[ID Ação])=IdentAcoes[[Quantidade de fontes de recursos ]]),0),0)),\"\")","v":"PCJ1.2.1.2/2024"},{"$f":"IFERROR(INDEX(IdentAcoes[Descrição da ação],MATCH(0,INDEX(--(COUNTIF(C$1:C35,IdentAcoes[Descrição da ação])=IdentAcoes[[Quantidade de fontes de recursos ]]),0),0)),\"\")","v":"Elaboração de projetos de melhorias da eficiência das ETEs na remoção de nutrientes"},"FEHIDRO - Cobrança estadual",1300000,null,null,1000000,null,null,750000,null,null,750000]
[{"$f":"Financeiro[[#This Row],[ID Ação]]&Financeiro[[#This Row],[Fonte]]","v":"PCJ1.2.2.2/2027FEHIDRO - Cobrança estadual"},{"$f":"IFERROR(INDEX(IdentAcoes[ID Ação],MATCH(0,INDEX(--(COUNTIF(B$1:B36,IdentAcoes[ID Ação])=IdentAcoes[[Quantidade de fontes de recursos ]]),0),0)),\"\")","v":"PCJ1.2.2.2/2027"},{"$f":"IFERROR(INDEX(IdentAcoes[Descrição da ação],MATCH(0,INDEX(--(COUNTIF(C$1:C36,IdentAcoes[Descrição da ação])=IdentAcoes[[Quantidade de fontes de recursos ]]),0),0)),\"\")","v":"Elaboração de projetos de implantação de tecnologias de desinfecção de efluentes domésticos"},"FEHIDRO - Cobrança estadual",0,null,null,0,null,null,0,null,null,500000]
[{"$f":"Financeiro[[#This Row],[ID Ação]]&Financeiro[[#This Row],[Fonte]]","v":"PCJ3.1.2.3/2024FEHIDRO - Cobrança estadual"},{"$f":"IFERROR(INDEX(IdentAcoes[ID Ação],MATCH(0,INDEX(--(COUNTIF(B$1:B37,IdentAcoes[ID Ação])=IdentAcoes[[Quantidade de fontes de recursos ]]),0),0)),\"\")","v":"PCJ3.1.2.3/2024"},{"$f":"IFERROR(INDEX(IdentAcoes[Descrição da ação],MATCH(0,INDEX(--(COUNTIF(C$1:C37,IdentAcoes[Descrição da ação])=IdentAcoes[[Quantidade de fontes de recursos ]]),0),0)),\"\")","v":"Incentivo à proteção das áreas sujeitas à restrição de uso"},"FEHIDRO - Cobrança estadual",0,null,null,0,null,null,0,null,null,0]
[{"$f":"Financeiro[[#This Row],[ID Ação]]&Financeiro[[#This Row],[Fonte]]","v":"PCJ2.3.2.2/2024FEHIDRO - Cobrança estadual"},{"$f":"IFERROR(INDEX(IdentAcoes[ID Ação],MATCH(0,INDEX(--(COUNTIF(B$1:B38,IdentAcoes[ID Ação])=IdentAcoes[[Quantidade de fontes de recursos ]]),0),0)),\"\")","v":"PCJ2.3.2.2/2024"},{"$f":"IFERROR(INDEX(IdentAcoes[Descrição da ação],MATCH(0,INDEX(--(COUNTIF(C$1:C38,IdentAcoes[Descrição da ação])=IdentAcoes[[Quantidade de fontes de recursos ]]),0),0)),\"\")","v":"Controle de perdas em sistemas de abastecimento de água"},"FEHIDRO - Cobrança estadual",5120748.0999999996,null,null,4551857.16,null,null,1500000,null,null,1500000]
[{"$f":"Financeiro[[#This Row],[ID Ação]]&Financeiro[[#This Row],[Fonte]]","v":"PCJ5.2.2.1/2024FEHIDRO - Cobrança estadual"},{"$f":"IFERROR(INDEX(IdentAcoes[ID Ação],MATCH(0,INDEX(--(COUNTIF(B$1:B39,IdentAcoes[ID Ação])=IdentAcoes[[Quantidade de fontes de recursos ]]),0),0)),\"\")","v":"PCJ5.2.2.1/2024"},{"$f":"IFERROR(INDEX(IdentAcoes[Descrição da ação],MATCH(0,INDEX(--(COUNTIF(C$1:C39,IdentAcoes[Descrição da ação])=IdentAcoes[[Quantidade de fontes de recursos ]]),0),0)),\"\")","v":"Elaboração de propostas para órgãos de financiamento em pesquisas"},"FEHIDRO - Cobrança estadual",0,null,null,0,null,null,0,null,null,0]
[{"$f":"Financeiro[[#This Row],[ID Ação]]&Financeiro[[#This Row],[Fonte]]","v":"PCJ5.2.2.3/2024FEHIDRO - Cobrança estadual"},{"$f":"IFERROR(INDEX(IdentAcoes[ID Ação],MATCH(0,INDEX(--(COUNTIF(B$1:B40,IdentAcoes[ID Ação])=IdentAcoes[[Quantidade de fontes de recursos ]]),0),0)),\"\")","v":"PCJ5.2.2.3/2024"},{"$f":"IFERROR(INDEX(IdentAcoes[Descrição da ação],MATCH(0,INDEX(--(COUNTIF(C$1:C40,IdentAcoes[Descrição da ação])=IdentAcoes[[Quantidade de fontes de recursos ]]),0),0)),\"\")","v":"Apoio ao desenvolvimento e difusão de pesquisas e tecnologias que contribuam no enfrentamento dos desafios identificados no Plano das Bacias PCJ"},"FEHIDRO - Cobrança estadual",0,null,null,0,null,null,0,null,null,0]
[{"$f":"Financeiro[[#This Row],[ID Ação]]&Financeiro[[#This Row],[Fonte]]","v":"PCJ6.2.5.2/2027FEHIDRO - Cobrança estadual"},{"$f":"IFERROR(INDEX(IdentAcoes[ID Ação],MATCH(0,INDEX(--(COUNTIF(B$1:B41,IdentAcoes[ID Ação])=IdentAcoes[[Quantidade de fontes de recursos ]]),0),0)),\"\")","v":"PCJ6.2.5.2/2027"},{"$f":"IFERROR(INDEX(IdentAcoes[Descrição da ação],MATCH(0,INDEX(--(COUNTIF(C$1:C41,IdentAcoes[Descrição da ação])=IdentAcoes[[Quantidade de fontes de recursos ]]),0),0)),\"\")","v":"Apoio à regularização de outorga na área rural"},"FEHIDRO - Cobrança estadual",0,null,null,0,null,null,0,null,null,400000]
[{"$f":"Financeiro[[#This Row],[ID Ação]]&Financeiro[[#This Row],[Fonte]]","v":"PCJ1.1.1.1/2024Outras fontes"},{"$f":"IFERROR(INDEX(IdentAcoes[ID Ação],MATCH(0,INDEX(--(COUNTIF(B$1:B42,IdentAcoes[ID Ação])=IdentAcoes[[Quantidade de fontes de recursos ]]),0),0)),\"\")","v":"PCJ1.1.1.1/2024"},{"$f":"IFERROR(INDEX(IdentAcoes[Descrição da ação],MATCH(0,INDEX(--(COUNTIF(C$1:C42,IdentAcoes[Descrição da ação])=IdentAcoes[[Quantidade de fontes de recursos ]]),0),0)),\"\")","v":"Elaboração de estudos para ampliação e melhoria dos sistemas de coleta de esgotos"},"Outras fontes",0,null,null,0,null,null,0,null,null,0]
[{"$f":"Financeiro[[#This Row],[ID Ação]]&Financeiro[[#This Row],[Fonte]]","v":"PCJ2.2.3.1/2024Cobrança Federal"},{"$f":"IFERROR(INDEX(IdentAcoes[ID Ação],MATCH(0,INDEX(--(COUNTIF(B$1:B43,IdentAcoes[ID Ação])=IdentAcoes[[Quantidade de fontes de recursos ]]),0),0)),\"\")","v":"PCJ2.2.3.1/2024"},{"$f":"IFERROR(INDEX(IdentAcoes[Descrição da ação],MATCH(0,INDEX(--(COUNTIF(C$1:C43,IdentAcoes[Descrição da ação])=IdentAcoes[[Quantidade de fontes de recursos ]]),0),0)),\"\")","v":"Acompanhamento e apoio aos estudos de viabilidade, projetos de engenharia e licenciamento ambiental das barragens de Pedreira, Duas Pontes e do ribeirão Piraí e do trecho Oeste do SAR"},"Cobrança Federal",387303.25,null,null,0,null,null,0,null,null,0]
[{"$f":"Financeiro[[#This Row],[ID Ação]]&Financeiro[[#This Row],[Fonte]]","v":"PCJ2.3.3.1/2024Cobrança Federal"},{"$f":"IFERROR(INDEX(IdentAcoes[ID Ação],MATCH(0,INDEX(--(COUNTIF(B$1:B44,IdentAcoes[ID Ação])=IdentAcoes[[Quantidade de fontes de recursos ]]),0),0)),\"\")","v":"PCJ2.3.3.1/2024"},{"$f":"IFERROR(INDEX(IdentAcoes[Descrição da ação],MATCH(0,INDEX(--(COUNTIF(C$1:C44,IdentAcoes[Descrição da ação])=IdentAcoes[[Quantidade de fontes de recursos ]]),0),0)),\"\")","v":"Elaboração de um guia de manejo de drenagem e manejo de águas pluviais"},"Cobrança Federal",170000,null,null,0,null,null,0,null,null,0]
[{"$f":"Financeiro[[#This Row],[ID Ação]]&Financeiro[[#This Row],[Fonte]]","v":"PCJ1.3.1.2/2025Cobrança Federal"},{"$f":"IFERROR(INDEX(IdentAcoes[ID Ação],MATCH(0,INDEX(--(COUNTIF(B$1:B45,IdentAcoes[ID Ação])=IdentAcoes[[Quantidade de fontes de recursos ]]),0),0)),\"\")","v":"PCJ1.3.1.2/2025"},{"$f":"IFERROR(INDEX(IdentAcoes[Descrição da ação],MATCH(0,INDEX(--(COUNTIF(C$1:C45,IdentAcoes[Descrição da ação])=IdentAcoes[[Quantidade de fontes de recursos ]]),0),0)),\"\")","v":"Elaboração de estudo piloto para avaliação da carga difusa de origem urbana e rural afluente nos corpos hídricos das Bacias PCJ"},"Cobrança Federal",0,null,null,490046.84125302196,null,null,0,null,null,0]
[{"$f":"Financeiro[[#This Row],[ID Ação]]&Financeiro[[#This Row],[Fonte]]","v":"PCJ6.2.5.3/2024Cobrança Federal"},{"$f":"IFERROR(INDEX(IdentAcoes[ID Ação],MATCH(0,INDEX(--(COUNTIF(B$1:B46,IdentAcoes[ID Ação])=IdentAcoes[[Quantidade de fontes de recursos ]]),0),0)),\"\")","v":"PCJ6.2.5.3/2024"},{"$f":"IFERROR(INDEX(IdentAcoes[Descrição da ação],MATCH(0,INDEX(--(COUNTIF(C$1:C46,IdentAcoes[Descrição da ação])=IdentAcoes[[Quantidade de fontes de recursos ]]),0),0)),\"\")","v":"Apoio operacional para fiscalização de outorgas"},"Cobrança Federal",2200000,null,null,1400000,null,null,0,null,null,0]
[{"$f":"Financeiro[[#This Row],[ID Ação]]&Financeiro[[#This Row],[Fonte]]","v":"PCJ6.1.1.2/2024Cobrança Federal"},{"$f":"IFERROR(INDEX(IdentAcoes[ID Ação],MATCH(0,INDEX(--(COUNTIF(B$1:B47,IdentAcoes[ID Ação])=IdentAcoes[[Quantidade de fontes de recursos ]]),0),0)),\"\")","v":"PCJ6.1.1.2/2024"},{"$f":"IFERROR(INDEX(IdentAcoes[Descrição da ação],MATCH(0,INDEX(--(COUNTIF(C$1:C47,IdentAcoes[Descrição da ação])=IdentAcoes[[Quantidade de fontes de recursos ]]),0),0)),\"\")","v":"Apoio operacional para a área de cobrança pelo uso dos recursos hídricos"},"Cobrança Federal",3715960.39,null,null,3822087.0821859101,null,null,0,null,null,0]
[{"$f":"Financeiro[[#This Row],[ID Ação]]&Financeiro[[#This Row],[Fonte]]","v":"PCJ6.1.1.5/2024Cobrança Federal"},{"$f":"IFERROR(INDEX(IdentAcoes[ID Ação],MATCH(0,INDEX(--(COUNTIF(B$1:B48,IdentAcoes[ID Ação])=IdentAcoes[[Quantidade de fontes de recursos ]]),0),0)),\"\")","v":"PCJ6.1.1.5/2024"},{"$f":"IFERROR(INDEX(IdentAcoes[Descrição da ação],MATCH(0,INDEX(--(COUNTIF(C$1:C48,IdentAcoes[Descrição da ação])=IdentAcoes[[Quantidade de fontes de recursos ]]),0),0)),\"\")","v":"Apoio operacional para acompanhamento de projetos da área de Sistema de Informações "},"Cobrança Federal",3200000,null,null,3200000,null,null,0,null,null,0]
[{"$f":"Financeiro[[#This Row],[ID Ação]]&Financeiro[[#This Row],[Fonte]]","v":"PCJ6.2.3.1/2024Cobrança Federal"},{"$f":"IFERROR(INDEX(IdentAcoes[ID Ação],MATCH(0,INDEX(--(COUNTIF(B$1:B49,IdentAcoes[ID Ação])=IdentAcoes[[Quantidade de fontes de recursos ]]),0),0)),\"\")","v":"PCJ6.2.3.1/2024"},{"$f":"IFERROR(INDEX(IdentAcoes[Descrição da ação],MATCH(0,INDEX(--(COUNTIF(C$1:C49,IdentAcoes[Descrição da ação])=IdentAcoes[[Quantidade de fontes de recursos ]]),0),0)),\"\")","v":"Expansão, integração, operação e manutenção da rede de monitoramento quali-quantitativo dos recursos hídricos"},"Cobrança Federal",5183320.4400000004,null,null,4340020.0145200007,null,null,0,null,null,0]
[{"$f":"Financeiro[[#This Row],[ID Ação]]&Financeiro[[#This Row],[Fonte]]","v":"PCJ2.1.1.1/2024Cobrança Federal"},{"$f":"IFERROR(INDEX(IdentAcoes[ID Ação],MATCH(0,INDEX(--(COUNTIF(B$1:B50,IdentAcoes[ID Ação])=IdentAcoes[[Quantidade de fontes de recursos ]]),0),0)),\"\")","v":"PCJ2.1.1.1/2024"},{"$f":"IFERROR(INDEX(IdentAcoes[Descrição da ação],MATCH(0,INDEX(--(COUNTIF(C$1:C50,IdentAcoes[Descrição da ação])=IdentAcoes[[Quantidade de fontes de recursos ]]),0),0)),\"\")","v":"Manutenção e aprimoramento de um modelo chuva-vazão para as Bacias PCJ"},"Cobrança Federal",538170.04,null,null,555929.6498637161,null,null,0,null,null,0]
[{"$f":"Financeiro[[#This Row],[ID Ação]]&Financeiro[[#This Row],[Fonte]]","v":"PCJ2.1.2.1/2025Cobrança Federal"},{"$f":"IFERROR(INDEX(IdentAcoes[ID Ação],MATCH(0,INDEX(--(COUNTIF(B$1:B51,IdentAcoes[ID Ação])=IdentAcoes[[Quantidade de fontes de recursos ]]),0),0)),\"\")","v":"PCJ2.1.2.1/2025"},{"$f":"IFERROR(INDEX(IdentAcoes[Descrição da ação],MATCH(0,INDEX(--(COUNTIF(C$1:C51,IdentAcoes[Descrição da ação])=IdentAcoes[[Quantidade de fontes de recursos ]]),0),0)),\"\")","v":"Aprimoramento de modelo de simulação hidrodinâmica do tempo de trânsito e do amortecimento da vazão preferencialmente à jusante do Sistema Cantareira"},"Cobrança Federal",0,null,null,541863.21,null,null,0,null,null,0]
[{"$f":"Financeiro[[#This Row],[ID Ação]]&Financeiro[[#This Row],[Fonte]]","v":"PCJ6.2.6.1/2024Cobrança Federal"},{"$f":"IFERROR(INDEX(IdentAcoes[ID Ação],MATCH(0,INDEX(--(COUNTIF(B$1:B52,IdentAcoes[ID Ação])=IdentAcoes[[Quantidade de fontes de recursos ]]),0),0)),\"\")","v":"PCJ6.2.6.1/2024"},{"$f":"IFERROR(INDEX(IdentAcoes[Descrição da ação],MATCH(0,INDEX(--(COUNTIF(C$1:C52,IdentAcoes[Descrição da ação])=IdentAcoes[[Quantidade de fontes de recursos ]]),0),0)),\"\")","v":"Apoio operacional para gerenciamento da implementação e da revisão do Plano de Bacias"},"Cobrança Federal",1869464.32,null,null,1898156.6425600001,null,null,0,null,null,0]
[{"$f":"Financeiro[[#This Row],[ID Ação]]&Financeiro[[#This Row],[Fonte]]","v":"PCJ6.1.1.4/2024Cobrança Federal"},{"$f":"IFERROR(INDEX(IdentAcoes[ID Ação],MATCH(0,INDEX(--(COUNTIF(B$1:B53,IdentAcoes[ID Ação])=IdentAcoes[[Quantidade de fontes de recursos ]]),0),0)),\"\")","v":"PCJ6.1.1.4/2024"},{"$f":"IFERROR(INDEX(IdentAcoes[Descrição da ação],MATCH(0,INDEX(--(COUNTIF(C$1:C53,IdentAcoes[Descrição da ação])=IdentAcoes[[Quantidade de fontes de recursos ]]),0),0)),\"\")","v":"Apoio Operacional para acompanhamento de empreendimentos de demanda espontânea"},"Cobrança Federal",1506712.43,null,null,1556433.9390976413,null,null,0,null,null,0]
[{"$f":"Financeiro[[#This Row],[ID Ação]]&Financeiro[[#This Row],[Fonte]]","v":"PCJ6.1.2.2/2024Cobrança Federal"},{"$f":"IFERROR(INDEX(IdentAcoes[ID Ação],MATCH(0,INDEX(--(COUNTIF(B$1:B54,IdentAcoes[ID Ação])=IdentAcoes[[Quantidade de fontes de recursos ]]),0),0)),\"\")","v":"PCJ6.1.2.2/2024"},{"$f":"IFERROR(INDEX(IdentAcoes[Descrição da ação],MATCH(0,INDEX(--(COUNTIF(C$1:C54,IdentAcoes[Descrição da ação])=IdentAcoes[[Quantidade de fontes de recursos ]]),0),0)),\"\")","v":"Remuneração de agentes técnicos e financeiros para empreendimentos deliberados pelos Comitês PCJ"},"Cobrança Federal",1316626.55,null,null,1316626.55,null,null,0,null,null,0]
[{"$f":"Financeiro[[#This Row],[ID Ação]]&Financeiro[[#This Row],[Fonte]]","v":"PCJ6.1.2.3/2024Cobrança Federal"},{"$f":"IFERROR(INDEX(IdentAcoes[ID Ação],MATCH(0,INDEX(--(COUNTIF(B$1:B55,IdentAcoes[ID Ação])=IdentAcoes[[Quantidade de fontes de recursos ]]),0),0)),\"\")","v":"PCJ6.1.2.3/2024"},{"$f":"IFERROR(INDEX(IdentAcoes[Descrição da ação],MATCH(0,INDEX(--(COUNTIF(C$1:C55,IdentAcoes[Descrição da ação])=IdentAcoes[[Quantidade de fontes de recursos ]]),0),0)),\"\")","v":"Logística de Suporte às reuniões Plenárias e das CTs dos Comitês PCJ"},"Cobrança Federal",400000,null,null,400000,null,null,0,null,null,0]
[{"$f":"Financeiro[[#This Row],[ID Ação]]&Financeiro[[#This Row],[Fonte]]","v":"PCJ6.1.2.1/2024Cobrança Federal"},{"$f":"IFERROR(INDEX(IdentAcoes[ID Ação],MATCH(0,INDEX(--(COUNTIF(B$1:B56,IdentAcoes[ID Ação])=IdentAcoes[[Quantidade de fontes de recursos ]]),0),0)),\"\")","v":"PCJ6.1.2.1/2024"},{"$f":"IFERROR(INDEX(IdentAcoes[Descrição da ação],MATCH(0,INDEX(--(COUNTIF(C$1:C56,IdentAcoes[Descrição da ação])=IdentAcoes[[Quantidade de fontes de recursos ]]),0),0)),\"\")","v":"Apoio operacional para a Secretaria Executiva dos Comitês PCJ"},"Cobrança Federal",4342000,null,null,2300000,null,null,0,null,null,0]
[{"$f":"Financeiro[[#This Row],[ID Ação]]&Financeiro[[#This Row],[Fonte]]","v":"PCJ6.1.1.7/2024Cobrança Federal"},{"$f":"IFERROR(INDEX(IdentAcoes[ID Ação],MATCH(0,INDEX(--(COUNTIF(B$1:B57,IdentAcoes[ID Ação])=IdentAcoes[[Quantidade de fontes de recursos ]]),0),0)),\"\")","v":"PCJ6.1.1.7/2024"},{"$f":"IFERROR(INDEX(IdentAcoes[Descrição da ação],MATCH(0,INDEX(--(COUNTIF(C$1:C57,IdentAcoes[Descrição da ação])=IdentAcoes[[Quantidade de fontes de recursos ]]),0),0)),\"\")","v":"Apoio operacional para acompanhamento de ações da porção mineira"},"Cobrança Federal",385560,null,null,385560,null,null,0,null,null,0]
[{"$f":"Financeiro[[#This Row],[ID Ação]]&Financeiro[[#This Row],[Fonte]]","v":"PCJ6.1.1.1/2024Cobrança Federal"},{"$f":"IFERROR(INDEX(IdentAcoes[ID Ação],MATCH(0,INDEX(--(COUNTIF(B$1:B58,IdentAcoes[ID Ação])=IdentAcoes[[Quantidade de fontes de recursos ]]),0),0)),\"\")","v":"PCJ6.1.1.1/2024"},{"$f":"IFERROR(INDEX(IdentAcoes[Descrição da ação],MATCH(0,INDEX(--(COUNTIF(C$1:C58,IdentAcoes[Descrição da ação])=IdentAcoes[[Quantidade de fontes de recursos ]]),0),0)),\"\")","v":"Apoio operacional para a Área de Tecnologia da Informação - TI"},"Cobrança Federal",809312.42,null,null,836019.72616293433,null,null,0,null,null,0]
[{"$f":"Financeiro[[#This Row],[ID Ação]]&Financeiro[[#This Row],[Fonte]]","v":"PCJ6.1.2.4/2024Cobrança Federal"},{"$f":"IFERROR(INDEX(IdentAcoes[ID Ação],MATCH(0,INDEX(--(COUNTIF(B$1:B59,IdentAcoes[ID Ação])=IdentAcoes[[Quantidade de fontes de recursos ]]),0),0)),\"\")","v":"PCJ6.1.2.4/2024"},{"$f":"IFERROR(INDEX(IdentAcoes[Descrição da ação],MATCH(0,INDEX(--(COUNTIF(C$1:C59,IdentAcoes[Descrição da ação])=IdentAcoes[[Quantidade de fontes de recursos ]]),0),0)),\"\")","v":"Participação de membros dos Comitês PCJ em eventos internos das CTs e eventos externos"},"Cobrança Federal",326049.12,null,null,336808.74096000008,null,null,0,null,null,0]
[{"$f":"Financeiro[[#This Row],[ID Ação]]&Financeiro[[#This Row],[Fonte]]","v":"PCJ6.1.2.5/2024Cobrança Federal"},{"$f":"IFERROR(INDEX(IdentAcoes[ID Ação],MATCH(0,INDEX(--(COUNTIF(B$1:B60,IdentAcoes[ID Ação])=IdentAcoes[[Quantidade de fontes de recursos ]]),0),0)),\"\")","v":"PCJ6.1.2.5/2024"},{"$f":"IFERROR(INDEX(IdentAcoes[Descrição da ação],MATCH(0,INDEX(--(COUNTIF(C$1:C60,IdentAcoes[Descrição da ação])=IdentAcoes[[Quantidade de fontes de recursos ]]),0),0)),\"\")","v":"Manutenção de licenciamento de sistemas de TI"},"Cobrança Federal",2178708,null,null,2250605.3639999996,null,null,0,null,null,0]
[{"$f":"Financeiro[[#This Row],[ID Ação]]&Financeiro[[#This Row],[Fonte]]","v":"PCJ1.2.2.3/2024FEHIDRO - Cobrança estadual"},{"$f":"IFERROR(INDEX(IdentAcoes[ID Ação],MATCH(0,INDEX(--(COUNTIF(B$1:B61,IdentAcoes[ID Ação])=IdentAcoes[[Quantidade de fontes de recursos ]]),0),0)),\"\")","v":"PCJ1.2.2.3/2024"},{"$f":"IFERROR(INDEX(IdentAcoes[Descrição da ação],MATCH(0,INDEX(--(COUNTIF(C$1:C61,IdentAcoes[Descrição da ação])=IdentAcoes[[Quantidade de fontes de recursos ]]),0),0)),\"\")","v":"Implantação das tecnologias de desinfecção projetadas"},"FEHIDRO - Cobrança estadual",1500000,null,null,750000,null,null,750000,null,null,750000]
[{"$f":"Financeiro[[#This Row],[ID Ação]]&Financeiro[[#This Row],[Fonte]]","v":"PCJ1.1.2.5/2024FEHIDRO - Cobrança estadual"},{"$f":"IFERROR(INDEX(IdentAcoes[ID Ação],MATCH(0,INDEX(--(COUNTIF(B$1:B62,IdentAcoes[ID Ação])=IdentAcoes[[Quantidade de fontes de recursos ]]),0),0)),\"\")","v":"PCJ1.1.2.5/2024"},{"$f":"IFERROR(INDEX(IdentAcoes[Descrição da ação],MATCH(0,INDEX(--(COUNTIF(C$1:C62,IdentAcoes[Descrição da ação])=IdentAcoes[[Quantidade de fontes de recursos ]]),0),0)),\"\")","v":"Implantação das ETEs projetadas e melhorias das ETEs existentes"},"FEHIDRO - Cobrança estadual",3000000,null,null,1500000,null,null,1000000,null,null,1500000]
[{"$f":"Financeiro[[#This Row],[ID Ação]]&Financeiro[[#This Row],[Fonte]]","v":"PCJ1.2.1.9/2024FEHIDRO - Cobrança estadual"},{"$f":"IFERROR(INDEX(IdentAcoes[ID Ação],MATCH(0,INDEX(--(COUNTIF(B$1:B63,IdentAcoes[ID Ação])=IdentAcoes[[Quantidade de fontes de recursos ]]),0),0)),\"\")","v":"PCJ1.2.1.9/2024"},{"$f":"IFERROR(INDEX(IdentAcoes[Descrição da ação],MATCH(0,INDEX(--(COUNTIF(C$1:C63,IdentAcoes[Descrição da ação])=IdentAcoes[[Quantidade de fontes de recursos ]]),0),0)),\"\")","v":"Implantação das melhorias das ETEs projetadas e retrofit de ETEs para remoção de nutrientes"},"FEHIDRO - Cobrança estadual",3000000,null,null,1500000,null,null,1000000,null,null,2000000]
[{"$f":"Financeiro[[#This Row],[ID Ação]]&Financeiro[[#This Row],[Fonte]]","v":"PCJ1.2.1.8/2024FEHIDRO - Cobrança estadual"},{"$f":"IFERROR(INDEX(IdentAcoes[ID Ação],MATCH(0,INDEX(--(COUNTIF(B$1:B64,IdentAcoes[ID Ação])=IdentAcoes[[Quantidade de fontes de recursos ]]),0),0)),\"\")","v":"PCJ1.2.1.8/2024"},{"$f":"IFERROR(INDEX(IdentAcoes[Descrição da ação],MATCH(0,INDEX(--(COUNTIF(C$1:C64,IdentAcoes[Descrição da ação])=IdentAcoes[[Quantidade de fontes de recursos ]]),0),0)),\"\")","v":"Implantação de Unidades de Tratamento de Lodo nas ETAs"},"FEHIDRO - Cobrança estadual",2300000,null,null,1000000,null,null,0,null,null,0]
[{"$f":"Financeiro[[#This Row],[ID Ação]]&Financeiro[[#This Row],[Fonte]]","v":"PCJ1.1.1.3/2024Outras fontes"},{"$f":"IFERROR(INDEX(IdentAcoes[ID Ação],MATCH(0,INDEX(--(COUNTIF(B$1:B65,IdentAcoes[ID Ação])=IdentAcoes[[Quantidade de fontes de recursos ]]),0),0)),\"\")","v":"PCJ1.1.1.3/2024"},{"$f":"IFERROR(INDEX(IdentAcoes[Descrição da ação],MATCH(0,INDEX(--(COUNTIF(C$1:C65,IdentAcoes[Descrição da ação])=IdentAcoes[[Quantidade de fontes de recursos ]]),0),0)),\"\")","v":"Elaboração de projetos de ampliação e melhoria dos sistemas de coleta de esgotos"},"Outras fontes",0,null,null,0,null,null,0,null,null,0]
[{"$f":"Financeiro[[#This Row],[ID Ação]]&Financeiro[[#This Row],[Fonte]]","v":"PCJ1.1.1.5/2024FEHIDRO - Cobrança estadual"},{"$f":"IFERROR(INDEX(IdentAcoes[ID Ação],MATCH(0,INDEX(--(COUNTIF(B$1:B66,IdentAcoes[ID Ação])=IdentAcoes[[Quantidade de fontes de recursos ]]),0),0)),\"\")","v":"PCJ1.1.1.5/2024"},{"$f":"IFERROR(INDEX(IdentAcoes[Descrição da ação],MATCH(0,INDEX(--(COUNTIF(C$1:C66,IdentAcoes[Descrição da ação])=IdentAcoes[[Quantidade de fontes de recursos ]]),0),0)),\"\")","v":"Ampliações e melhoria dos sistemas de coleta de esgotos"},"FEHIDRO - Cobrança estadual",2500000,null,null,1000000,null,null,0,null,null,0]
[{"$f":"Financeiro[[#This Row],[ID Ação]]&Financeiro[[#This Row],[Fonte]]","v":"PCJ1.3.2.1/2024Outras fontes"},{"$f":"IFERROR(INDEX(IdentAcoes[ID Ação],MATCH(0,INDEX(--(COUNTIF(B$1:B67,IdentAcoes[ID Ação])=IdentAcoes[[Quantidade de fontes de recursos ]]),0),0)),\"\")","v":"PCJ1.3.2.1/2024"},{"$f":"IFERROR(INDEX(IdentAcoes[Descrição da ação],MATCH(0,INDEX(--(COUNTIF(C$1:C67,IdentAcoes[Descrição da ação])=IdentAcoes[[Quantidade de fontes de recursos ]]),0),0)),\"\")","v":"Elaboração de projetos demonstrativos para contenção de cargas difusas de origem rural e urbana"},"Outras fontes",0,null,null,0,null,null,0,null,null,0]
[{"$f":"Financeiro[[#This Row],[ID Ação]]&Financeiro[[#This Row],[Fonte]]","v":"PCJ1.3.2.3/2024Outras fontes"},{"$f":"IFERROR(INDEX(IdentAcoes[ID Ação],MATCH(0,INDEX(--(COUNTIF(B$1:B68,IdentAcoes[ID Ação])=IdentAcoes[[Quantidade de fontes de recursos ]]),0),0)),\"\")","v":"PCJ1.3.2.3/2024"},{"$f":"IFERROR(INDEX(IdentAcoes[Descrição da ação],MATCH(0,INDEX(--(COUNTIF(C$1:C68,IdentAcoes[Descrição da ação])=IdentAcoes[[Quantidade de fontes de recursos ]]),0),0)),\"\")","v":"Implantação de medidas de contenção de cargas difusas de origem rural e urbana em locais prioritários"},"Outras fontes",0,null,null,0,null,null,0,null,null,0]
[{"$f":"Financeiro[[#This Row],[ID Ação]]&Financeiro[[#This Row],[Fonte]]","v":"PCJ3.1.2.5/2024Cobrança Federal"},{"$f":"IFERROR(INDEX(IdentAcoes[ID Ação],MATCH(0,INDEX(--(COUNTIF(B$1:B69,IdentAcoes[ID Ação])=IdentAcoes[[Quantidade de fontes de recursos ]]),0),0)),\"\")","v":"PCJ3.1.2.5/2024"},{"$f":"IFERROR(INDEX(IdentAcoes[Descrição da ação],MATCH(0,INDEX(--(COUNTIF(C$1:C69,IdentAcoes[Descrição da ação])=IdentAcoes[[Quantidade de fontes de recursos ]]),0),0)),\"\")","v":"Estabilização de voçorocas nas propriedades que receberão projetos de recomposição florestal (fonte: PDRF)"},"Cobrança Federal",0,null,null,0,null,null,0,null,null,0]
[{"$f":"Financeiro[[#This Row],[ID Ação]]&Financeiro[[#This Row],[Fonte]]","v":"PCJ6.1.1.3/2024Cobrança Federal"},{"$f":"IFERROR(INDEX(IdentAcoes[ID Ação],MATCH(0,INDEX(--(COUNTIF(B$1:B70,IdentAcoes[ID Ação])=IdentAcoes[[Quantidade de fontes de recursos ]]),0),0)),\"\")","v":"PCJ6.1.1.3/2024"},{"$f":"IFERROR(INDEX(IdentAcoes[Descrição da ação],MATCH(0,INDEX(--(COUNTIF(C$1:C70,IdentAcoes[Descrição da ação])=IdentAcoes[[Quantidade de fontes de recursos ]]),0),0)),\"\")","v":"Apoio operacional para acompanhamento de projetos de assessoria ambiental"},"Cobrança Federal",2100000,null,null,2100000,null,null,0,null,null,0]
[{"$f":"Financeiro[[#This Row],[ID Ação]]&Financeiro[[#This Row],[Fonte]]","v":"PCJ3.1.2.1/2024Cobrança Federal"},{"$f":"IFERROR(INDEX(IdentAcoes[ID Ação],MATCH(0,INDEX(--(COUNTIF(B$1:B71,IdentAcoes[ID Ação])=IdentAcoes[[Quantidade de fontes de recursos ]]),0),0)),\"\")","v":"PCJ3.1.2.1/2024"},{"$f":"IFERROR(INDEX(IdentAcoes[Descrição da ação],MATCH(0,INDEX(--(COUNTIF(C$1:C71,IdentAcoes[Descrição da ação])=IdentAcoes[[Quantidade de fontes de recursos ]]),0),0)),\"\")","v":"Promoção da conservação e recuperação de nascentes, matas ciliares e áreas de recarga"},"Cobrança Federal",500000,null,null,500000,null,null,0,null,null,0]
[{"$f":"Financeiro[[#This Row],[ID Ação]]&Financeiro[[#This Row],[Fonte]]","v":"PCJ3.1.3.1/2024Cobrança Federal"},{"$f":"IFERROR(INDEX(IdentAcoes[ID Ação],MATCH(0,INDEX(--(COUNTIF(B$1:B72,IdentAcoes[ID Ação])=IdentAcoes[[Quantidade de fontes de recursos ]]),0),0)),\"\")","v":"PCJ3.1.3.1/2024"},{"$f":"IFERROR(INDEX(IdentAcoes[Descrição da ação],MATCH(0,INDEX(--(COUNTIF(C$1:C72,IdentAcoes[Descrição da ação])=IdentAcoes[[Quantidade de fontes de recursos ]]),0),0)),\"\")","v":"Implementação de projetos de PSA"},"Cobrança Federal",0,null,null,0,null,null,0,null,null,0]
[{"$f":"Financeiro[[#This Row],[ID Ação]]&Financeiro[[#This Row],[Fonte]]","v":"PCJ3.1.1.1/2024Cobrança Federal"},{"$f":"IFERROR(INDEX(IdentAcoes[ID Ação],MATCH(0,INDEX(--(COUNTIF(B$1:B73,IdentAcoes[ID Ação])=IdentAcoes[[Quantidade de fontes de recursos ]]),0),0)),\"\")","v":"PCJ3.1.1.1/2024"},{"$f":"IFERROR(INDEX(IdentAcoes[Descrição da ação],MATCH(0,INDEX(--(COUNTIF(C$1:C73,IdentAcoes[Descrição da ação])=IdentAcoes[[Quantidade de fontes de recursos ]]),0),0)),\"\")","v":"Desenvolvimento e monitoramento da implementação dos PIPs"},"Cobrança Federal",600000,null,null,600000,null,null,0,null,null,0]
[{"$f":"Financeiro[[#This Row],[ID Ação]]&Financeiro[[#This Row],[Fonte]]","v":"PCJ5.3.1.2/2024Cobrança Federal"},{"$f":"IFERROR(INDEX(IdentAcoes[ID Ação],MATCH(0,INDEX(--(COUNTIF(B$1:B74,IdentAcoes[ID Ação])=IdentAcoes[[Quantidade de fontes de recursos ]]),0),0)),\"\")","v":"PCJ5.3.1.2/2024"},{"$f":"IFERROR(INDEX(IdentAcoes[Descrição da ação],MATCH(0,INDEX(--(COUNTIF(C$1:C74,IdentAcoes[Descrição da ação])=IdentAcoes[[Quantidade de fontes de recursos ]]),0),0)),\"\")","v":"Elaboração de um Plano de Capacitação Técnica e realização de processos formativos nas áreas de atuação das Câmaras Técnicas"},"Cobrança Federal",191079.13,null,null,197384.74178716226,null,null,0,null,null,0]
[{"$f":"Financeiro[[#This Row],[ID Ação]]&Financeiro[[#This Row],[Fonte]]","v":"PCJ1.4.1.2/2024Cobrança Federal"},{"$f":"IFERROR(INDEX(IdentAcoes[ID Ação],MATCH(0,INDEX(--(COUNTIF(B$1:B75,IdentAcoes[ID Ação])=IdentAcoes[[Quantidade de fontes de recursos ]]),0),0)),\"\")","v":"PCJ1.4.1.2/2024"},{"$f":"IFERROR(INDEX(IdentAcoes[Descrição da ação],MATCH(0,INDEX(--(COUNTIF(C$1:C75,IdentAcoes[Descrição da ação])=IdentAcoes[[Quantidade de fontes de recursos ]]),0),0)),\"\")","v":"Ampliação e divulgação do programa de capacitação (Escola da Água e Saneamento), fomento e incentivo à capacitação de operadores"},"Cobrança Federal",75000,null,null,75000,null,null,0,null,null,0]
[{"$f":"Financeiro[[#This Row],[ID Ação]]&Financeiro[[#This Row],[Fonte]]","v":"PCJ5.2.1.2/2024Cobrança Federal"},{"$f":"IFERROR(INDEX(IdentAcoes[ID Ação],MATCH(0,INDEX(--(COUNTIF(B$1:B76,IdentAcoes[ID Ação])=IdentAcoes[[Quantidade de fontes de recursos ]]),0),0)),\"\")","v":"PCJ5.2.1.2/2024"},{"$f":"IFERROR(INDEX(IdentAcoes[Descrição da ação],MATCH(0,INDEX(--(COUNTIF(C$1:C76,IdentAcoes[Descrição da ação])=IdentAcoes[[Quantidade de fontes de recursos ]]),0),0)),\"\")","v":"Realização de processos formativos e campanhas educativas sobre a realidade das Bacias PCJ"},"Cobrança Federal",1000000,null,null,750000,null,null,0,null,null,0]
[{"$f":"Financeiro[[#This Row],[ID Ação]]&Financeiro[[#This Row],[Fonte]]","v":"PCJ5.1.1.1/2024Cobrança Federal"},{"$f":"IFERROR(INDEX(IdentAcoes[ID Ação],MATCH(0,INDEX(--(COUNTIF(B$1:B77,IdentAcoes[ID Ação])=IdentAcoes[[Quantidade de fontes de recursos ]]),0),0)),\"\")","v":"PCJ5.1.1.1/2024"},{"$f":"IFERROR(INDEX(IdentAcoes[Descrição da ação],MATCH(0,INDEX(--(COUNTIF(C$1:C77,IdentAcoes[Descrição da ação])=IdentAcoes[[Quantidade de fontes de recursos ]]),0),0)),\"\")","v":"Elaboração e execução de um Plano de Comunicação para o fortalecimento da comunicação entre a sociedade civil e os Comitês PCJ"},"Cobrança Federal",750000,null,null,750000,null,null,0,null,null,0]
[{"$f":"Financeiro[[#This Row],[ID Ação]]&Financeiro[[#This Row],[Fonte]]","v":"PCJ6.1.1.6/2024Cobrança Federal"},{"$f":"IFERROR(INDEX(IdentAcoes[ID Ação],MATCH(0,INDEX(--(COUNTIF(B$1:B78,IdentAcoes[ID Ação])=IdentAcoes[[Quantidade de fontes de recursos ]]),0),0)),\"\")","v":"PCJ6.1.1.6/2024"},{"$f":"IFERROR(INDEX(IdentAcoes[Descrição da ação],MATCH(0,INDEX(--(COUNTIF(C$1:C78,IdentAcoes[Descrição da ação])=IdentAcoes[[Quantidade de fontes de recursos ]]),0),0)),\"\")","v":"Apoio operacional para a área de comunicação social"},"Cobrança Federal",375902.03,null,null,388306.79745278403,null,null,0,null,null,0]
[{"$f":"Financeiro[[#This Row],[ID Ação]]&Financeiro[[#This Row],[Fonte]]","v":"PCJ5.2.1.3/2024Cobrança Federal"},{"$f":"IFERROR(INDEX(IdentAcoes[ID Ação],MATCH(0,INDEX(--(COUNTIF(B$1:B79,IdentAcoes[ID Ação])=IdentAcoes[[Quantidade de fontes de recursos ]]),0),0)),\"\")","v":"PCJ5.2.1.3/2024"},{"$f":"IFERROR(INDEX(IdentAcoes[Descrição da ação],MATCH(0,INDEX(--(COUNTIF(C$1:C79,IdentAcoes[Descrição da ação])=IdentAcoes[[Quantidade de fontes de recursos ]]),0),0)),\"\")","v":"Elaboração e divulgação de materiais educativos"},"Cobrança Federal",500000,null,null,500000,null,null,0,null,null,0]
[{"$f":"Financeiro[[#This Row],[ID Ação]]&Financeiro[[#This Row],[Fonte]]","v":""},{"$f":"IFERROR(INDEX(IdentAcoes[ID Ação],MATCH(0,INDEX(--(COUNTIF(B$1:B80,IdentAcoes[ID Ação])=IdentAcoes[[Quantidade de fontes de recursos ]]),0),0)),\"\")","v":""},{"$f":"IFERROR(INDEX(IdentAcoes[Descrição da ação],MATCH(0,INDEX(--(COUNTIF(C$1:C80,IdentAcoes[Descrição da ação])=IdentAcoes[[Quantidade de fontes de recursos ]]),0),0)),\"\")","v":""}]
[{"$f":"Financeiro[[#This Row],[ID Ação]]&Financeiro[[#This Row],[Fonte]]","v":""},{"$f":"IFERROR(INDEX(IdentAcoes[ID Ação],MATCH(0,INDEX(--(COUNTIF(B$1:B81,IdentAcoes[ID Ação])=IdentAcoes[[Quantidade de fontes de recursos ]]),0),0)),\"\")","v":""},{"$f":"IFERROR(INDEX(IdentAcoes[Descrição da ação],MATCH(0,INDEX(--(COUNTIF(C$1:C81,IdentAcoes[Descrição da ação])=IdentAcoes[[Quantidade de fontes de recursos ]]),0),0)),\"\")","v":""}]
[{"$f":"Financeiro[[#This Row],[ID Ação]]&Financeiro[[#This Row],[Fonte]]","v":""},{"$f":"IFERROR(INDEX(IdentAcoes[ID Ação],MATCH(0,INDEX(--(COUNTIF(B$1:B82,IdentAcoes[ID Ação])=IdentAcoes[[Quantidade de fontes de recursos ]]),0),0)),\"\")","v":""},{"$f":"IFERROR(INDEX(IdentAcoes[Descrição da ação],MATCH(0,INDEX(--(COUNTIF(C$1:C82,IdentAcoes[Descrição da ação])=IdentAcoes[[Quantidade de fontes de recursos ]]),0),0)),\"\")","v":""}]
[{"$f":"Financeiro[[#This Row],[ID Ação]]&Financeiro[[#This Row],[Fonte]]","v":""},{"$f":"IFERROR(INDEX(IdentAcoes[ID Ação],MATCH(0,INDEX(--(COUNTIF(B$1:B83,IdentAcoes[ID Ação])=IdentAcoes[[Quantidade de fontes de recursos ]]),0),0)),\"\")","v":""},{"$f":"IFERROR(INDEX(IdentAcoes[Descrição da ação],MATCH(0,INDEX(--(COUNTIF(C$1:C83,IdentAcoes[Descrição da ação])=IdentAcoes[[Quantidade de fontes de recursos ]]),0),0)),\"\")","v":""}]
[{"$f":"Financeiro[[#This Row],[ID Ação]]&Financeiro[[#This Row],[Fonte]]","v":""},{"$f":"IFERROR(INDEX(IdentAcoes[ID Ação],MATCH(0,INDEX(--(COUNTIF(B$1:B84,IdentAcoes[ID Ação])=IdentAcoes[[Quantidade de fontes de recursos ]]),0),0)),\"\")","v":""},{"$f":"IFERROR(INDEX(IdentAcoes[Descrição da ação],MATCH(0,INDEX(--(COUNTIF(C$1:C84,IdentAcoes[Descrição da ação])=IdentAcoes[[Quantidade de fontes de recursos ]]),0),0)),\"\")","v":""}]
[{"$f":"Financeiro[[#This Row],[ID Ação]]&Financeiro[[#This Row],[Fonte]]","v":""},{"$f":"IFERROR(INDEX(IdentAcoes[ID Ação],MATCH(0,INDEX(--(COUNTIF(B$1:B85,IdentAcoes[ID Ação])=IdentAcoes[[Quantidade de fontes de recursos ]]),0),0)),\"\")","v":""},{"$f":"IFERROR(INDEX(IdentAcoes[Descrição da ação],MATCH(0,INDEX(--(COUNTIF(C$1:C85,IdentAcoes[Descrição da ação])=IdentAcoes[[Quantidade de fontes de recursos ]]),0),0)),\"\")","v":""}]
[{"$f":"Financeiro[[#This Row],[ID Ação]]&Financeiro[[#This Row],[Fonte]]","v":""},{"$f":"IFERROR(INDEX(IdentAcoes[ID Ação],MATCH(0,INDEX(--(COUNTIF(B$1:B86,IdentAcoes[ID Ação])=IdentAcoes[[Quantidade de fontes de recursos ]]),0),0)),\"\")","v":""},{"$f":"IFERROR(INDEX(IdentAcoes[Descrição da ação],MATCH(0,INDEX(--(COUNTIF(C$1:C86,IdentAcoes[Descrição da ação])=IdentAcoes[[Quantidade de fontes de recursos ]]),0),0)),\"\")","v":""}]
[{"$f":"Financeiro[[#This Row],[ID Ação]]&Financeiro[[#This Row],[Fonte]]","v":""},{"$f":"IFERROR(INDEX(IdentAcoes[ID Ação],MATCH(0,INDEX(--(COUNTIF(B$1:B87,IdentAcoes[ID Ação])=IdentAcoes[[Quantidade de fontes de recursos ]]),0),0)),\"\")","v":""},{"$f":"IFERROR(INDEX(IdentAcoes[Descrição da ação],MATCH(0,INDEX(--(COUNTIF(C$1:C87,IdentAcoes[Descrição da ação])=IdentAcoes[[Quantidade de fontes de recursos ]]),0),0)),\"\")","v":""}]
[{"$f":"Financeiro[[#This Row],[ID Ação]]&Financeiro[[#This Row],[Fonte]]","v":""},{"$f":"IFERROR(INDEX(IdentAcoes[ID Ação],MATCH(0,INDEX(--(COUNTIF(B$1:B88,IdentAcoes[ID Ação])=IdentAcoes[[Quantidade de fontes de recursos ]]),0),0)),\"\")","v":""},{"$f":"IFERROR(INDEX(IdentAcoes[Descrição da ação],MATCH(0,INDEX(--(COUNTIF(C$1:C88,IdentAcoes[Descrição da ação])=IdentAcoes[[Quantidade de fontes de recursos ]]),0),0)),\"\")","v":""}]
[{"$f":"Financeiro[[#This Row],[ID Ação]]&Financeiro[[#This Row],[Fonte]]","v":""},{"$f":"IFERROR(INDEX(IdentAcoes[ID Ação],MATCH(0,INDEX(--(COUNTIF(B$1:B89,IdentAcoes[ID Ação])=IdentAcoes[[Quantidade de fontes de recursos ]]),0),0)),\"\")","v":""},{"$f":"IFERROR(INDEX(IdentAcoes[Descrição da ação],MATCH(0,INDEX(--(COUNTIF(C$1:C89,IdentAcoes[Descrição da ação])=IdentAcoes[[Quantidade de fontes de recursos ]]),0),0)),\"\")","v":""}]
[{"$f":"Financeiro[[#This Row],[ID Ação]]&Financeiro[[#This Row],[Fonte]]","v":""},{"$f":"IFERROR(INDEX(IdentAcoes[ID Ação],MATCH(0,INDEX(--(COUNTIF(B$1:B90,IdentAcoes[ID Ação])=IdentAcoes[[Quantidade de fontes de recursos ]]),0),0)),\"\")","v":""},{"$f":"IFERROR(INDEX(IdentAcoes[Descrição da ação],MATCH(0,INDEX(--(COUNTIF(C$1:C90,IdentAcoes[Descrição da ação])=IdentAcoes[[Quantidade de fontes de recursos ]]),0),0)),\"\")","v":""}]
[{"$f":"Financeiro[[#This Row],[ID Ação]]&Financeiro[[#This Row],[Fonte]]","v":""},{"$f":"IFERROR(INDEX(IdentAcoes[ID Ação],MATCH(0,INDEX(--(COUNTIF(B$1:B91,IdentAcoes[ID Ação])=IdentAcoes[[Quantidade de fontes de recursos ]]),0),0)),\"\")","v":""},{"$f":"IFERROR(INDEX(IdentAcoes[Descrição da ação],MATCH(0,INDEX(--(COUNTIF(C$1:C91,IdentAcoes[Descrição da ação])=IdentAcoes[[Quantidade de fontes de recursos ]]),0),0)),\"\")","v":""}]
[{"$f":"Financeiro[[#This Row],[ID Ação]]&Financeiro[[#This Row],[Fonte]]","v":""},{"$f":"IFERROR(INDEX(IdentAcoes[ID Ação],MATCH(0,INDEX(--(COUNTIF(B$1:B92,IdentAcoes[ID Ação])=IdentAcoes[[Quantidade de fontes de recursos ]]),0),0)),\"\")","v":""},{"$f":"IFERROR(INDEX(IdentAcoes[Descrição da ação],MATCH(0,INDEX(--(COUNTIF(C$1:C92,IdentAcoes[Descrição da ação])=IdentAcoes[[Quantidade de fontes de recursos ]]),0),0)),\"\")","v":""}]
[{"$f":"Financeiro[[#This Row],[ID Ação]]&Financeiro[[#This Row],[Fonte]]","v":""},{"$f":"IFERROR(INDEX(IdentAcoes[ID Ação],MATCH(0,INDEX(--(COUNTIF(B$1:B93,IdentAcoes[ID Ação])=IdentAcoes[[Quantidade de fontes de recursos ]]),0),0)),\"\")","v":""},{"$f":"IFERROR(INDEX(IdentAcoes[Descrição da ação],MATCH(0,INDEX(--(COUNTIF(C$1:C93,IdentAcoes[Descrição da ação])=IdentAcoes[[Quantidade de fontes de recursos ]]),0),0)),\"\")","v":""}]
[{"$f":"Financeiro[[#This Row],[ID Ação]]&Financeiro[[#This Row],[Fonte]]","v":""},{"$f":"IFERROR(INDEX(IdentAcoes[ID Ação],MATCH(0,INDEX(--(COUNTIF(B$1:B94,IdentAcoes[ID Ação])=IdentAcoes[[Quantidade de fontes de recursos ]]),0),0)),\"\")","v":""},{"$f":"IFERROR(INDEX(IdentAcoes[Descrição da ação],MATCH(0,INDEX(--(COUNTIF(C$1:C94,IdentAcoes[Descrição da ação])=IdentAcoes[[Quantidade de fontes de recursos ]]),0),0)),\"\")","v":""}]
[{"$f":"Financeiro[[#This Row],[ID Ação]]&Financeiro[[#This Row],[Fonte]]","v":""},{"$f":"IFERROR(INDEX(IdentAcoes[ID Ação],MATCH(0,INDEX(--(COUNTIF(B$1:B95,IdentAcoes[ID Ação])=IdentAcoes[[Quantidade de fontes de recursos ]]),0),0)),\"\")","v":""},{"$f":"IFERROR(INDEX(IdentAcoes[Descrição da ação],MATCH(0,INDEX(--(COUNTIF(C$1:C95,IdentAcoes[Descrição da ação])=IdentAcoes[[Quantidade de fontes de recursos ]]),0),0)),\"\")","v":""}]
[{"$f":"Financeiro[[#This Row],[ID Ação]]&Financeiro[[#This Row],[Fonte]]","v":""},{"$f":"IFERROR(INDEX(IdentAcoes[ID Ação],MATCH(0,INDEX(--(COUNTIF(B$1:B96,IdentAcoes[ID Ação])=IdentAcoes[[Quantidade de fontes de recursos ]]),0),0)),\"\")","v":""},{"$f":"IFERROR(INDEX(IdentAcoes[Descrição da ação],MATCH(0,INDEX(--(COUNTIF(C$1:C96,IdentAcoes[Descrição da ação])=IdentAcoes[[Quantidade de fontes de recursos ]]),0),0)),\"\")","v":""}]
[{"$f":"Financeiro[[#This Row],[ID Ação]]&Financeiro[[#This Row],[Fonte]]","v":""},{"$f":"IFERROR(INDEX(IdentAcoes[ID Ação],MATCH(0,INDEX(--(COUNTIF(B$1:B97,IdentAcoes[ID Ação])=IdentAcoes[[Quantidade de fontes de recursos ]]),0),0)),\"\")","v":""},{"$f":"IFERROR(INDEX(IdentAcoes[Descrição da ação],MATCH(0,INDEX(--(COUNTIF(C$1:C97,IdentAcoes[Descrição da ação])=IdentAcoes[[Quantidade de fontes de recursos ]]),0),0)),\"\")","v":""}]
[{"$f":"Financeiro[[#This Row],[ID Ação]]&Financeiro[[#This Row],[Fonte]]","v":""},{"$f":"IFERROR(INDEX(IdentAcoes[ID Ação],MATCH(0,INDEX(--(COUNTIF(B$1:B98,IdentAcoes[ID Ação])=IdentAcoes[[Quantidade de fontes de recursos ]]),0),0)),\"\")","v":""},{"$f":"IFERROR(INDEX(IdentAcoes[Descrição da ação],MATCH(0,INDEX(--(COUNTIF(C$1:C98,IdentAcoes[Descrição da ação])=IdentAcoes[[Quantidade de fontes de recursos ]]),0),0)),\"\")","v":""}]
[{"$f":"Financeiro[[#This Row],[ID Ação]]&Financeiro[[#This Row],[Fonte]]","v":""},{"$f":"IFERROR(INDEX(IdentAcoes[ID Ação],MATCH(0,INDEX(--(COUNTIF(B$1:B99,IdentAcoes[ID Ação])=IdentAcoes[[Quantidade de fontes de recursos ]]),0),0)),\"\")","v":""},{"$f":"IFERROR(INDEX(IdentAcoes[Descrição da ação],MATCH(0,INDEX(--(COUNTIF(C$1:C99,IdentAcoes[Descrição da ação])=IdentAcoes[[Quantidade de fontes de recursos ]]),0),0)),\"\")","v":""}]

{"sheet":"PAPI 2024-2027","index":4,"n_rows":101,"n_cols":15,"rows_kept":101,"cut":false,"hidden":false,"merged":[]}
[null,null,null,null,null,"R$ Planejado"]
["id_ação_Fonte_oculta","ID Ação","Descrição da ação","Meta","Fonte",2024,2025,2026,2027,"Total","SubPDC","Prioridade do PDC","Segmento do executor","Área de abrangência","Nome da área de abrangência"]
[{"$f":"IF(INDEX(Financeiro[],,1)=0,\"\",(INDEX(Financeiro[],,1)))","v":"PCJ3.3.1.2/2024FEHIDRO - Cobrança estadual"},{"$f":"IF(INDEX(Financeiro[],,2)=0,\"\",(INDEX(Financeiro[],,2)))","v":"PCJ3.3.1.2/2024"},{"$f":"INDEX(Financeiro[Descrição da ação],MATCH(B3,Financeiro[ID Ação], 0))","v":"Fomento a Planos Municipais de Saneamento Rural"},{"$f":"IF(INDEX('Acompanhamento das metas 24-27'!$C$2:$C$50,MATCH(B3,'Acompanhamento das metas 24-27'!$A$2:$A$50,0))<>0,INDEX('Acompanhamento das metas 24-27'!$C$2:$C$50,MATCH(B3,'Acompanhamento das metas 24-27'!$A$2:$A$50,0)),\"\")","v":"15 Planos Municipais de Saneamento Rural elaborados"},{"$f":"IF(VLOOKUP(A3,Financeiro[[id_ação_Fonte_oculta]:[R$  Executado (2027)]],4,FALSE)=0,\"\",VLOOKUP(A3,Financeiro[[id_ação_Fonte_oculta]:[R$  Executado (2027)]],4,FALSE))","v":"FEHIDRO - Cobrança estadual"},{"$f":"IF(VLOOKUP(A3,Financeiro[[id_ação_Fonte_oculta]:[R$  Executado (2027)]],4,FALSE)=0,\"\",VLOOKUP(A3,Financeiro[[id_ação_Fonte_oculta]:[R$  Executado (2027)]],5,FALSE))","v":1000000},{"$f":"IF(VLOOKUP(A3,Financeiro[[id_ação_Fonte_oculta]:[R$  Executado (2027)]],4,FALSE)=0,\"\",VLOOKUP(A3,Financeiro[[id_ação_Fonte_oculta]:[R$  Executado (2027)]],8,FALSE))","v":2000000},{"$f":"IF(VLOOKUP(A3,Financeiro[[id_ação_Fonte_oculta]:[R$  Executado (2027)]],4,FALSE)=0,\"\",VLOOKUP(A3,Financeiro[[id_ação_Fonte_oculta]:[R$  Executado (2027)]],11,FALSE))","v":1000000},{"$f":"IF(VLOOKUP(A3,Financeiro[[id_ação_Fonte_oculta]:[R$  Executado (2027)]],4,FALSE)=0,\"\",VLOOKUP(A3,Financeiro[[id_ação_Fonte_oculta]:[R$  Executado (2027)]],14,FALSE))","v":1341614.1282998323},{"$f":"SUM(F3:I3)","v":5341614.1282998323},{"$f":"IFERROR(INDEX(IdentAcoes[SubPDC],MATCH(B3,IdentAcoes[ID Ação],0)),\"\")","v":"1.2 - Planejamento"},{"$f":"IFERROR(INDEX(IdentAcoes[Prioridade do PDC],MATCH($B3,IdentAcoes[ID Ação],0)),\"\")","v":"PDC 1 e 2"},{"$f":"IFERROR(INDEX(IdentAcoes[Segmento do executor],MATCH($B3,IdentAcoes[ID Ação],0)),\"\")","v":"Município"},{"$f":"IFERROR(INDEX(IdentAcoes[Área de abrangência],MATCH($B3,IdentAcoes[ID Ação],0)),\"\")","v":"Bacia"},{"$f":"IFERROR(INDEX(IdentAcoes[Detalhamento da área de abrangência],MATCH($B3,IdentAcoes[ID Ação],0)),\"\")","v":"Bacias PCJ, observando os municípios e ACs prioritários para saneamento rural"}]
["PCJ3.3.1.2/2024FEHIDRO - CFURH","PCJ3.3.1.2/2024",{"$f":"INDEX(Financeiro[Descrição da ação],MATCH(B4,Financeiro[ID Ação], 0))","v":"Fomento a Planos Municipais de Saneamento Rural"},{"$f":"IF(INDEX('Acompanhamento das metas 24-27'!$C$2:$C$50,MATCH(B4,'Acompanhamento das metas 24-27'!$A$2:$A$50,0))<>0,INDEX('Acompanhamento das metas 24-27'!$C$2:$C$50,MATCH(B4,'Acompanhamento das metas 24-27'!$A$2:$A$50,0)),\"\")","v":"15 Planos Municipais de Saneamento Rural elaborados"},{"$f":"IF(VLOOKUP(A4,Financeiro[[id_ação_Fonte_oculta]:[R$  Executado (2027)]],4,FALSE)=0,\"\",VLOOKUP(A4,Financeiro[[id_ação_Fonte_oculta]:[R$  Executado (2027)]],4,FALSE))","v":"FEHIDRO - CFURH"},{"$f":"IF(VLOOKUP(A4,Financeiro[[id_ação_Fonte_oculta]:[R$  Executado (2027)]],4,FALSE)=0,\"\",VLOOKUP(A4,Financeiro[[id_ação_Fonte_oculta]:[R$  Executado (2027)]],5,FALSE))","v":822566.3},{"$f":"IF(VLOOKUP(A4,Financeiro[[id_ação_Fonte_oculta]:[R$  Executado (2027)]],4,FALSE)=0,\"\",VLOOKUP(A4,Financeiro[[id_ação_Fonte_oculta]:[R$  Executado (2027)]],8,FALSE))","v":861129.6},{"$f":"IF(VLOOKUP(A4,Financeiro[[id_ação_Fonte_oculta]:[R$  Executado (2027)]],4,FALSE)=0,\"\",VLOOKUP(A4,Financeiro[[id_ação_Fonte_oculta]:[R$  Executado (2027)]],11,FALSE))","v":901617},{"$f":"IF(VLOOKUP(A4,Financeiro[[id_ação_Fonte_oculta]:[R$  Executado (2027)]],4,FALSE)=0,\"\",VLOOKUP(A4,Financeiro[[id_ação_Fonte_oculta]:[R$  Executado (2027)]],14,FALSE))","v":944164},{"$f":"SUM(F4:I4)","v":3529476.9},{"$f":"IFERROR(INDEX(IdentAcoes[SubPDC],MATCH(B4,IdentAcoes[ID Ação],0)),\"\")","v":"1.2 - Planejamento"},{"$f":"IFERROR(INDEX(IdentAcoes[Prioridade do PDC],MATCH(B4,IdentAcoes[ID Ação],0)),\"\")","v":"PDC 1 e 2"},{"$f":"IFERROR(INDEX(IdentAcoes[Segmento do executor],MATCH($B4,IdentAcoes[ID Ação],0)),\"\")","v":"Município"},{"$f":"IFERROR(INDEX(IdentAcoes[Área de abrangência],MATCH($B4,IdentAcoes[ID Ação],0)),\"\")","v":"Bacia"},{"$f":"IFERROR(INDEX(IdentAcoes[Detalhamento da área de abrangência],MATCH($B4,IdentAcoes[ID Ação],0)),\"\")","v":"Bacias PCJ, observando os municípios e ACs prioritários para saneamento rural"}]
["PCJ2.3.1.1/2024FEHIDRO - Cobrança estadual","PCJ2.3.1.1/2024",{"$f":"INDEX(Financeiro[Descrição da ação],MATCH(B5,Financeiro[ID Ação], 0))","v":"Estudos de viabilidade para aumento de regularização de vazões em mananciais existentes e novos barramentos"},{"$f":"IF(INDEX('Acompanhamento das metas 24-27'!$C$2:$C$50,MATCH(B5,'Acompanhamento das metas 24-27'!$A$2:$A$50,0))<>0,INDEX('Acompanhamento das metas 24-27'!$C$2:$C$50,MATCH(B5,'Acompanhamento das metas 24-27'!$A$2:$A$50,0)),\"\")","v":"Termos de referência; Estudo elaborado"},{"$f":"IF(VLOOKUP(A5,Financeiro[[id_ação_Fonte_oculta]:[R$  Executado (2027)]],4,FALSE)=0,\"\",VLOOKUP(A5,Financeiro[[id_ação_Fonte_oculta]:[R$  Executado (2027)]],4,FALSE))","v":"FEHIDRO - Cobrança estadual"},{"$f":"IF(VLOOKUP(A5,Financeiro[[id_ação_Fonte_oculta]:[R$  Executado (2027)]],4,FALSE)=0,\"\",VLOOKUP(A5,Financeiro[[id_ação_Fonte_oculta]:[R$  Executado (2027)]],5,FALSE))","v":1000000},{"$f":"IF(VLOOKUP(A5,Financeiro[[id_ação_Fonte_oculta]:[R$  Executado (2027)]],4,FALSE)=0,\"\",VLOOKUP(A5,Financeiro[[id_ação_Fonte_oculta]:[R$  Executado (2027)]],8,FALSE))","v":1500000},{"$f":"IF(VLOOKUP(A5,Financeiro[[id_ação_Fonte_oculta]:[R$  Executado (2027)]],4,FALSE)=0,\"\",VLOOKUP(A5,Financeiro[[id_ação_Fonte_oculta]:[R$  Executado (2027)]],11,FALSE))","v":500000},{"$f":"IF(VLOOKUP(A5,Financeiro[[id_ação_Fonte_oculta]:[R$  Executado (2027)]],4,FALSE)=0,\"\",VLOOKUP(A5,Financeiro[[id_ação_Fonte_oculta]:[R$  Executado (2027)]],14,FALSE))","v":500000},3500000,{"$f":"IFERROR(INDEX(IdentAcoes[SubPDC],MATCH(B5,IdentAcoes[ID Ação],0)),\"\")","v":"1.2 - Planejamento"},{"$f":"IFERROR(INDEX(IdentAcoes[Prioridade do PDC],MATCH(B5,IdentAcoes[ID Ação],0)),\"\")","v":"PDC 1 e 2"},{"$f":"IFERROR(INDEX(IdentAcoes[Segmento do executor],MATCH($B5,IdentAcoes[ID Ação],0)),\"\")","v":"Município"},{"$f":"IFERROR(INDEX(IdentAcoes[Área de abrangência],MATCH($B5,IdentAcoes[ID Ação],0)),\"\")","v":"Corpo hídrico"},{"$f":"IFERROR(INDEX(IdentAcoes[Detalhamento da área de abrangência],MATCH($B5,IdentAcoes[ID Ação],0)),\"\")","v":"Bacias PCJ, observando os municípios e ACs prioritários"}]
["PCJ2.3.3.2/2024FEHIDRO - Cobrança estadual","PCJ2.3.3.2/2024",{"$f":"INDEX(Financeiro[Descrição da ação],MATCH(B6,Financeiro[ID Ação], 0))","v":"Elaboração dos Planos Diretores de Drenagem Urbana e Manejo de Águas Pluviais"},{"$f":"IF(INDEX('Acompanhamento das metas 24-27'!$C$2:$C$50,MATCH(B6,'Acompanhamento das metas 24-27'!$A$2:$A$50,0))<>0,INDEX('Acompanhamento das metas 24-27'!$C$2:$C$50,MATCH(B6,'Acompanhamento das metas 24-27'!$A$2:$A$50,0)),\"\")","v":"Elaboração de ao menos 01 Plano, considerando os trechos vulneráveis indicados no Plano de Bacias"},{"$f":"IF(VLOOKUP(A6,Financeiro[[id_ação_Fonte_oculta]:[R$  Executado (2027)]],4,FALSE)=0,\"\",VLOOKUP(A6,Financeiro[[id_ação_Fonte_oculta]:[R$  Executado (2027)]],4,FALSE))","v":"FEHIDRO - Cobrança estadual"},{"$f":"IF(VLOOKUP(A6,Financeiro[[id_ação_Fonte_oculta]:[R$  Executado (2027)]],4,FALSE)=0,\"\",VLOOKUP(A6,Financeiro[[id_ação_Fonte_oculta]:[R$  Executado (2027)]],5,FALSE))","v":1500000},{"$f":"IF(VLOOKUP(A6,Financeiro[[id_ação_Fonte_oculta]:[R$  Executado (2027)]],4,FALSE)=0,\"\",VLOOKUP(A6,Financeiro[[id_ação_Fonte_oculta]:[R$  Executado (2027)]],8,FALSE))","v":1500000},{"$f":"IF(VLOOKUP(A6,Financeiro[[id_ação_Fonte_oculta]:[R$  Executado (2027)]],4,FALSE)=0,\"\",VLOOKUP(A6,Financeiro[[id_ação_Fonte_oculta]:[R$  Executado (2027)]],11,FALSE))","v":1000000},{"$f":"IF(VLOOKUP(A6,Financeiro[[id_ação_Fonte_oculta]:[R$  Executado (2027)]],4,FALSE)=0,\"\",VLOOKUP(A6,Financeiro[[id_ação_Fonte_oculta]:[R$  Executado (2027)]],14,FALSE))","v":1000000},5000000,{"$f":"IFERROR(INDEX(IdentAcoes[SubPDC],MATCH(B6,IdentAcoes[ID Ação],0)),\"\")","v":"1.2 - Planejamento"},{"$f":"IFERROR(INDEX(IdentAcoes[Prioridade do PDC],MATCH(B6,IdentAcoes[ID Ação],0)),\"\")","v":"PDC 1 e 2"},{"$f":"IFERROR(INDEX(IdentAcoes[Segmento do executor],MATCH($B6,IdentAcoes[ID Ação],0)),\"\")","v":"Município"},{"$f":"IFERROR(INDEX(IdentAcoes[Área de abrangência],MATCH($B6,IdentAcoes[ID Ação],0)),\"\")","v":"Município"},{"$f":"IFERROR(INDEX(IdentAcoes[Detalhamento da área de abrangência],MATCH($B6,IdentAcoes[ID Ação],0)),\"\")","v":"Municípios observando as prioridades no Plano de Bacias"}]
["PCJ1.2.1.5/2024FEHIDRO - Cobrança estadual","PCJ1.2.1.5/2024",{"$f":"INDEX(Financeiro[Descrição da ação],MATCH(B7,Financeiro[ID Ação], 0))","v":"Cadastro, caracterização e modelagem de cargas industriais"},{"$f":"IF(INDEX('Acompanhamento das metas 24-27'!$C$2:$C$50,MATCH(B7,'Acompanhamento das metas 24-27'!$A$2:$A$50,0))<>0,INDEX('Acompanhamento das metas 24-27'!$C$2:$C$50,MATCH(B7,'Acompanhamento das metas 24-27'!$A$2:$A$50,0)),\"\")","v":"Ao menos 01 estudo realizado "},{"$f":"IF(VLOOKUP(A7,Financeiro[[id_ação_Fonte_oculta]:[R$  Executado (2027)]],4,FALSE)=0,\"\",VLOOKUP(A7,Financeiro[[id_ação_Fonte_oculta]:[R$  Executado (2027)]],4,FALSE))","v":"FEHIDRO - Cobrança estadual"},{"$f":"IF(VLOOKUP(A7,Financeiro[[id_ação_Fonte_oculta]:[R$  Executado (2027)]],4,FALSE)=0,\"\",VLOOKUP(A7,Financeiro[[id_ação_Fonte_oculta]:[R$  Executado (2027)]],5,FALSE))","v":2000000},{"$f":"IF(VLOOKUP(A7,Financeiro[[id_ação_Fonte_oculta]:[R$  Executado (2027)]],4,FALSE)=0,\"\",VLOOKUP(A7,Financeiro[[id_ação_Fonte_oculta]:[R$  Executado (2027)]],8,FALSE))","v":0},{"$f":"IF(VLOOKUP(A7,Financeiro[[id_ação_Fonte_oculta]:[R$  Executado (2027)]],4,FALSE)=0,\"\",VLOOKUP(A7,Financeiro[[id_ação_Fonte_oculta]:[R$  Executado (2027)]],11,FALSE))","v":0},{"$f":"IF(VLOOKUP(A7,Financeiro[[id_ação_Fonte_oculta]:[R$  Executado (2027)]],4,FALSE)=0,\"\",VLOOKUP(A7,Financeiro[[id_ação_Fonte_oculta]:[R$  Executado (2027)]],14,FALSE))","v":0},2000000,{"$f":"IFERROR(INDEX(IdentAcoes[SubPDC],MATCH(B7,IdentAcoes[ID Ação],0)),\"\")","v":"1.2 - Planejamento"},{"$f":"IFERROR(INDEX(IdentAcoes[Prioridade do PDC],MATCH(B7,IdentAcoes[ID Ação],0)),\"\")","v":"PDC 1 e 2"},{"$f":"IFERROR(INDEX(IdentAcoes[Segmento do executor],MATCH($B7,IdentAcoes[ID Ação],0)),\"\")","v":"Sociedade Civil"},{"$f":"IFERROR(INDEX(IdentAcoes[Área de abrangência],MATCH($B7,IdentAcoes[ID Ação],0)),\"\")","v":"Bacia"},{"$f":"IFERROR(INDEX(IdentAcoes[Detalhamento da área de abrangência],MATCH($B7,IdentAcoes[ID Ação],0)),\"\")","v":"Bacias PCJ"}]
["PCJ1.2.1.6/2026FEHIDRO - Cobrança estadual","PCJ1.2.1.6/2026",{"$f":"INDEX(Financeiro[Descrição da ação],MATCH(B8,Financeiro[ID Ação], 0))","v":"Estudos de alternativas de diminuição da carga industrial"},{"$f":"IF(INDEX('Acompanhamento das metas 24-27'!$C$2:$C$50,MATCH(B8,'Acompanhamento das metas 24-27'!$A$2:$A$50,0))<>0,INDEX('Acompanhamento das metas 24-27'!$C$2:$C$50,MATCH(B8,'Acompanhamento das metas 24-27'!$A$2:$A$50,0)),\"\")","v":"Estudos realizados até 2026"},{"$f":"IF(VLOOKUP(A8,Financeiro[[id_ação_Fonte_oculta]:[R$  Executado (2027)]],4,FALSE)=0,\"\",VLOOKUP(A8,Financeiro[[id_ação_Fonte_oculta]:[R$  Executado (2027)]],4,FALSE))","v":"FEHIDRO - Cobrança estadual"},{"$f":"IF(VLOOKUP(A8,Financeiro[[id_ação_Fonte_oculta]:[R$  Executado (2027)]],4,FALSE)=0,\"\",VLOOKUP(A8,Financeiro[[id_ação_Fonte_oculta]:[R$  Executado (2027)]],5,FALSE))","v":0},{"$f":"IF(VLOOKUP(A8,Financeiro[[id_ação_Fonte_oculta]:[R$  Executado (2027)]],4,FALSE)=0,\"\",VLOOKUP(A8,Financeiro[[id_ação_Fonte_oculta]:[R$  Executado (2027)]],8,FALSE))","v":0},{"$f":"IF(VLOOKUP(A8,Financeiro[[id_ação_Fonte_oculta]:[R$  Executado (2027)]],4,FALSE)=0,\"\",VLOOKUP(A8,Financeiro[[id_ação_Fonte_oculta]:[R$  Executado (2027)]],11,FALSE))","v":513285.71999999764},{"$f":"IF(VLOOKUP(A8,Financeiro[[id_ação_Fonte_oculta]:[R$  Executado (2027)]],4,FALSE)=0,\"\",VLOOKUP(A8,Financeiro[[id_ação_Fonte_oculta]:[R$  Executado (2027)]],14,FALSE))","v":0},513285.71999999764,{"$f":"IFERROR(INDEX(IdentAcoes[SubPDC],MATCH(B8,IdentAcoes[ID Ação],0)),\"\")","v":"1.2 - Planejamento"},{"$f":"IFERROR(INDEX(IdentAcoes[Prioridade do PDC],MATCH(B8,IdentAcoes[ID Ação],0)),\"\")","v":"PDC 1 e 2"},{"$f":"IFERROR(INDEX(IdentAcoes[Segmento do executor],MATCH($B8,IdentAcoes[ID Ação],0)),\"\")","v":"Sociedade Civil"},{"$f":"IFERROR(INDEX(IdentAcoes[Área de abrangência],MATCH($B8,IdentAcoes[ID Ação],0)),\"\")","v":"Bacia"},{"$f":"IFERROR(INDEX(IdentAcoes[Detalhamento da área de abrangência],MATCH($B8,IdentAcoes[ID Ação],0)),\"\")","v":"Bacias PCJ, especialmente em municípios prioritários para tratamento secundário, nitrogênio e fósforo"}]
["PCJ1.2.2.1/2026FEHIDRO - Cobrança estadual","PCJ1.2.2.1/2026",{"$f":"INDEX(Financeiro[Descrição da ação],MATCH(B9,Financeiro[ID Ação], 0))","v":"Elaboração de estudos sobre os impactos da cloração de efluentes nos mananciais"},{"$f":"IF(INDEX('Acompanhamento das metas 24-27'!$C$2:$C$50,MATCH(B9,'Acompanhamento das metas 24-27'!$A$2:$A$50,0))<>0,INDEX('Acompanhamento das metas 24-27'!$C$2:$C$50,MATCH(B9,'Acompanhamento das metas 24-27'!$A$2:$A$50,0)),\"\")","v":"Estudos realizados até 2026"},{"$f":"IF(VLOOKUP(A9,Financeiro[[id_ação_Fonte_oculta]:[R$  Executado (2027)]],4,FALSE)=0,\"\",VLOOKUP(A9,Financeiro[[id_ação_Fonte_oculta]:[R$  Executado (2027)]],4,FALSE))","v":"FEHIDRO - Cobrança estadual"},{"$f":"IF(VLOOKUP(A9,Financeiro[[id_ação_Fonte_oculta]:[R$  Executado (2027)]],4,FALSE)=0,\"\",VLOOKUP(A9,Financeiro[[id_ação_Fonte_oculta]:[R$  Executado (2027)]],5,FALSE))","v":0},{"$f":"IF(VLOOKUP(A9,Financeiro[[id_ação_Fonte_oculta]:[R$  Executado (2027)]],4,FALSE)=0,\"\",VLOOKUP(A9,Financeiro[[id_ação_Fonte_oculta]:[R$  Executado (2027)]],8,FALSE))","v":0},{"$f":"IF(VLOOKUP(A9,Financeiro[[id_ação_Fonte_oculta]:[R$  Executado (2027)]],4,FALSE)=0,\"\",VLOOKUP(A9,Financeiro[[id_ação_Fonte_oculta]:[R$  Executado (2027)]],11,FALSE))","v":700000},{"$f":"IF(VLOOKUP(A9,Financeiro[[id_ação_Fonte_oculta]:[R$  Executado (2027)]],4,FALSE)=0,\"\",VLOOKUP(A9,Financeiro[[id_ação_Fonte_oculta]:[R$  Executado (2027)]],14,FALSE))","v":0},700000,{"$f":"IFERROR(INDEX(IdentAcoes[SubPDC],MATCH(B9,IdentAcoes[ID Ação],0)),\"\")","v":"1.2 - Planejamento"},{"$f":"IFERROR(INDEX(IdentAcoes[Prioridade do PDC],MATCH(B9,IdentAcoes[ID Ação],0)),\"\")","v":"PDC 1 e 2"},{"$f":"IFERROR(INDEX(IdentAcoes[Segmento do executor],MATCH($B9,IdentAcoes[ID Ação],0)),\"\")","v":"Sociedade Civil"},{"$f":"IFERROR(INDEX(IdentAcoes[Área de abrangência],MATCH($B9,IdentAcoes[ID Ação],0)),\"\")","v":"Bacia"},{"$f":"IFERROR(INDEX(IdentAcoes[Detalhamento da área de abrangência],MATCH($B9,IdentAcoes[ID Ação],0)),\"\")","v":"Bacias PCJ"}]
["PCJ1.3.1.1/2027FEHIDRO - Cobrança estadual","PCJ1.3.1.1/2027",{"$f":"INDEX(Financeiro[Descrição da ação],MATCH(B10,Financeiro[ID Ação], 0))","v":"Elaboração de estudo do background de fósforo nos corpos hídricos das Bacias PCJ e integração no SSD"},null,{"$f":"IF(VLOOKUP(A10,Financeiro[[id_ação_Fonte_oculta]:[R$  Executado (2027)]],4,FALSE)=0,\"\",VLOOKUP(A10,Financeiro[[id_ação_Fonte_oculta]:[R$  Executado (2027)]],4,FALSE))","v":"FEHIDRO - Cobrança estadual"},{"$f":"IF(VLOOKUP(A10,Financeiro[[id_ação_Fonte_oculta]:[R$  Executado (2027)]],4,FALSE)=0,\"\",VLOOKUP(A10,Financeiro[[id_ação_Fonte_oculta]:[R$  Executado (2027)]],5,FALSE))","v":0},{"$f":"IF(VLOOKUP(A10,Financeiro[[id_ação_Fonte_oculta]:[R$  Executado (2027)]],4,FALSE)=0,\"\",VLOOKUP(A10,Financeiro[[id_ação_Fonte_oculta]:[R$  Executado (2027)]],8,FALSE))","v":0},{"$f":"IF(VLOOKUP(A10,Financeiro[[id_ação_Fonte_oculta]:[R$  Executado (2027)]],4,FALSE)=0,\"\",VLOOKUP(A10,Financeiro[[id_ação_Fonte_oculta]:[R$  Executado (2027)]],11,FALSE))","v":0},{"$f":"IF(VLOOKUP(A10,Financeiro[[id_ação_Fonte_oculta]:[R$  Executado (2027)]],4,FALSE)=0,\"\",VLOOKUP(A10,Financeiro[[id_ação_Fonte_oculta]:[R$  Executado (2027)]],14,FALSE))","v":1707385.8717001672},1707385.8717001672,{"$f":"IFERROR(INDEX(IdentAcoes[SubPDC],MATCH(B10,IdentAcoes[ID Ação],0)),\"\")","v":"1.2 - Planejamento"},{"$f":"IFERROR(INDEX(IdentAcoes[Prioridade do PDC],MATCH(B10,IdentAcoes[ID Ação],0)),\"\")","v":"PDC 1 e 2"},{"$f":"IFERROR(INDEX(IdentAcoes[Segmento do executor],MATCH($B10,IdentAcoes[ID Ação],0)),\"\")","v":"Sociedade Civil"},{"$f":"IFERROR(INDEX(IdentAcoes[Área de abrangência],MATCH($B10,IdentAcoes[ID Ação],0)),\"\")","v":"Bacia"},{"$f":"IFERROR(INDEX(IdentAcoes[Detalhamento da área de abrangência],MATCH($B10,IdentAcoes[ID Ação],0)),\"\")","v":"Bacias PCJ"}]
["PCJ1.3.1.3/2026FEHIDRO - Cobrança estadual","PCJ1.3.1.3/2026",{"$f":"INDEX(Financeiro[Descrição da ação],MATCH(B11,Financeiro[ID Ação], 0))","v":"Elaboração de estudo sobre estruturas de controle e redução de cargas difusas e definição de metodologia para identificação e priorização de áreas potencialmente afetadas por cargas difusas de origem rural e urbana"},{"$f":"IF(INDEX('Acompanhamento das metas 24-27'!$C$2:$C$50,MATCH(B11,'Acompanhamento das metas 24-27'!$A$2:$A$50,0))<>0,INDEX('Acompanhamento das metas 24-27'!$C$2:$C$50,MATCH(B11,'Acompanhamento das metas 24-27'!$A$2:$A$50,0)),\"\")","v":"Estudo elaborado até final de 2026"},{"$f":"IF(VLOOKUP(A11,Financeiro[[id_ação_Fonte_oculta]:[R$  Executado (2027)]],4,FALSE)=0,\"\",VLOOKUP(A11,Financeiro[[id_ação_Fonte_oculta]:[R$  Executado (2027)]],4,FALSE))","v":"FEHIDRO - Cobrança estadual"},{"$f":"IF(VLOOKUP(A11,Financeiro[[id_ação_Fonte_oculta]:[R$  Executado (2027)]],4,FALSE)=0,\"\",VLOOKUP(A11,Financeiro[[id_ação_Fonte_oculta]:[R$  Executado (2027)]],5,FALSE))","v":0},{"$f":"IF(VLOOKUP(A11,Financeiro[[id_ação_Fonte_oculta]:[R$  Executado (2027)]],4,FALSE)=0,\"\",VLOOKUP(A11,Financeiro[[id_ação_Fonte_oculta]:[R$  Executado (2027)]],8,FALSE))","v":0},{"$f":"IF(VLOOKUP(A11,Financeiro[[id_ação_Fonte_oculta]:[R$  Executado (2027)]],4,FALSE)=0,\"\",VLOOKUP(A11,Financeiro[[id_ação_Fonte_oculta]:[R$  Executado (2027)]],11,FALSE))","v":2700000},{"$f":"IF(VLOOKUP(A11,Financeiro[[id_ação_Fonte_oculta]:[R$  Executado (2027)]],4,FALSE)=0,\"\",VLOOKUP(A11,Financeiro[[id_ação_Fonte_oculta]:[R$  Executado (2027)]],14,FALSE))","v":0},2700000,{"$f":"IFERROR(INDEX(IdentAcoes[SubPDC],MATCH(B11,IdentAcoes[ID Ação],0)),\"\")","v":"1.2 - Planejamento"},{"$f":"IFERROR(INDEX(IdentAcoes[Prioridade do PDC],MATCH(B11,IdentAcoes[ID Ação],0)),\"\")","v":"PDC 1 e 2"},{"$f":"IFERROR(INDEX(IdentAcoes[Segmento do executor],MATCH($B11,IdentAcoes[ID Ação],0)),\"\")","v":"Sociedade Civil"},{"$f":"IFERROR(INDEX(IdentAcoes[Área de abrangência],MATCH($B11,IdentAcoes[ID Ação],0)),\"\")","v":"Bacia"},{"$f":"IFERROR(INDEX(IdentAcoes[Detalhamento da área de abrangência],MATCH($B11,IdentAcoes[ID Ação],0)),\"\")","v":"Bacias PCJ"}]
["PCJ1.3.2.2/2026FEHIDRO - Cobrança estadual","PCJ1.3.2.2/2026",{"$f":"INDEX(Financeiro[Descrição da ação],MATCH(B12,Financeiro[ID Ação], 0))","v":"Elaboração de um Plano de Contenção de Cargas Difusas em locais prioritários nas Bacias PCJ"},{"$f":"IF(INDEX('Acompanhamento das metas 24-27'!$C$2:$C$50,MATCH(B12,'Acompanhamento das metas 24-27'!$A$2:$A$50,0))<>0,INDEX('Acompanhamento das metas 24-27'!$C$2:$C$50,MATCH(B12,'Acompanhamento das metas 24-27'!$A$2:$A$50,0)),\"\")","v":"Estudo elaborado até final de 2026"},{"$f":"IF(VLOOKUP(A12,Financeiro[[id_ação_Fonte_oculta]:[R$  Executado (2027)]],4,FALSE)=0,\"\",VLOOKUP(A12,Financeiro[[id_ação_Fonte_oculta]:[R$  Executado (2027)]],4,FALSE))","v":"FEHIDRO - Cobrança estadual"},{"$f":"IF(VLOOKUP(A12,Financeiro[[id_ação_Fonte_oculta]:[R$  Executado (2027)]],4,FALSE)=0,\"\",VLOOKUP(A12,Financeiro[[id_ação_Fonte_oculta]:[R$  Executado (2027)]],5,FALSE))","v":0},{"$f":"IF(VLOOKUP(A12,Financeiro[[id_ação_Fonte_oculta]:[R$  Executado (2027)]],4,FALSE)=0,\"\",VLOOKUP(A12,Financeiro[[id_ação_Fonte_oculta]:[R$  Executado (2027)]],8,FALSE))","v":0},{"$f":"IF(VLOOKUP(A12,Financeiro[[id_ação_Fonte_oculta]:[R$  Executado (2027)]],4,FALSE)=0,\"\",VLOOKUP(A12,Financeiro[[id_ação_Fonte_oculta]:[R$  Executado (2027)]],11,FALSE))","v":2000000},{"$f":"IF(VLOOKUP(A12,Financeiro[[id_ação_Fonte_oculta]:[R$  Executado (2027)]],4,FALSE)=0,\"\",VLOOKUP(A12,Financeiro[[id_ação_Fonte_oculta]:[R$  Executado (2027)]],14,FALSE))","v":0},2000000,{"$f":"IFERROR(INDEX(IdentAcoes[SubPDC],MATCH(B12,IdentAcoes[ID Ação],0)),\"\")","v":"1.2 - Planejamento"},{"$f":"IFERROR(INDEX(IdentAcoes[Prioridade do PDC],MATCH(B12,IdentAcoes[ID Ação],0)),\"\")","v":"PDC 1 e 2"},{"$f":"IFERROR(INDEX(IdentAcoes[Segmento do executor],MATCH($B12,IdentAcoes[ID Ação],0)),\"\")","v":"Sociedade Civil"},{"$f":"IFERROR(INDEX(IdentAcoes[Área de abrangência],MATCH($B12,IdentAcoes[ID Ação],0)),\"\")","v":"Bacia"},{"$f":"IFERROR(INDEX(IdentAcoes[Detalhamento da área de abrangência],MATCH($B12,IdentAcoes[ID Ação],0)),\"\")","v":"Bacias PCJ, observando as prioridades para fósforo e nitrogênio."}]
["PCJ6.3.2.1/2025FEHIDRO - Cobrança estadual","PCJ6.3.2.1/2025",{"$f":"INDEX(Financeiro[Descrição da ação],MATCH(B13,Financeiro[ID Ação], 0))","v":"Estudo para articulação entre CBHs visando a pactuação de condições de entrega"},{"$f":"IF(INDEX('Acompanhamento das metas 24-27'!$C$2:$C$50,MATCH(B13,'Acompanhamento das metas 24-27'!$A$2:$A$50,0))<>0,INDEX('Acompanhamento das metas 24-27'!$C$2:$C$50,MATCH(B13,'Acompanhamento das metas 24-27'!$A$2:$A$50,0)),\"\")","v":"Estudo elaborado até final de 2025"},{"$f":"IF(VLOOKUP(A13,Financeiro[[id_ação_Fonte_oculta]:[R$  Executado (2027)]],4,FALSE)=0,\"\",VLOOKUP(A13,Financeiro[[id_ação_Fonte_oculta]:[R$  Executado (2027)]],4,FALSE))","v":"FEHIDRO - Cobrança estadual"},{"$f":"IF(VLOOKUP(A13,Financeiro[[id_ação_Fonte_oculta]:[R$  Executado (2027)]],4,FALSE)=0,\"\",VLOOKUP(A13,Financeiro[[id_ação_Fonte_oculta]:[R$  Executado (2027)]],5,FALSE))","v":0},{"$f":"IF(VLOOKUP(A13,Financeiro[[id_ação_Fonte_oculta]:[R$  Executado (2027)]],4,FALSE)=0,\"\",VLOOKUP(A13,Financeiro[[id_ação_Fonte_oculta]:[R$  Executado (2027)]],8,FALSE))","v":600000},{"$f":"IF(VLOOKUP(A13,Financeiro[[id_ação_Fonte_oculta]:[R$  Executado (2027)]],4,FALSE)=0,\"\",VLOOKUP(A13,Financeiro[[id_ação_Fonte_oculta]:[R$  Executado (2027)]],11,FALSE))","v":0},{"$f":"IF(VLOOKUP(A13,Financeiro[[id_ação_Fonte_oculta]:[R$  Executado (2027)]],4,FALSE)=0,\"\",VLOOKUP(A13,Financeiro[[id_ação_Fonte_oculta]:[R$  Executado (2027)]],14,FALSE))","v":0},600000,{"$f":"IFERROR(INDEX(IdentAcoes[SubPDC],MATCH(B13,IdentAcoes[ID Ação],0)),\"\")","v":"1.2 - Planejamento"},{"$f":"IFERROR(INDEX(IdentAcoes[Prioridade do PDC],MATCH(B13,IdentAcoes[ID Ação],0)),\"\")","v":"PDC 1 e 2"},{"$f":"IFERROR(INDEX(IdentAcoes[Segmento do executor],MATCH($B13,IdentAcoes[ID Ação],0)),\"\")","v":"Sociedade Civil"},{"$f":"IFERROR(INDEX(IdentAcoes[Área de abrangência],MATCH($B13,IdentAcoes[ID Ação],0)),\"\")","v":"Bacia"},{"$f":"IFERROR(INDEX(IdentAcoes[Detalhamento da área de abrangência],MATCH($B13,IdentAcoes[ID Ação],0)),\"\")","v":"Bacias PCJ"}]
["PCJ1.1.1.2/2025FEHIDRO - Cobrança estadual","PCJ1.1.1.2/2025",{"$f":"INDEX(Financeiro[Descrição da ação],MATCH(B14,Financeiro[ID Ação], 0))","v":"Elaboração de estudos para ampliação e melhoria dos sistemas de transporte de esgotos"},{"$f":"IF(INDEX('Acompanhamento das metas 24-27'!$C$2:$C$50,MATCH(B14,'Acompanhamento das metas 24-27'!$A$2:$A$50,0))<>0,INDEX('Acompanhamento das metas 24-27'!$C$2:$C$50,MATCH(B14,'Acompanhamento das metas 24-27'!$A$2:$A$50,0)),\"\")","v":"Elaboração de ao menos 01 estudo"},{"$f":"IF(VLOOKUP(A14,Financeiro[[id_ação_Fonte_oculta]:[R$  Executado (2027)]],4,FALSE)=0,\"\",VLOOKUP(A14,Financeiro[[id_ação_Fonte_oculta]:[R$  Executado (2027)]],4,FALSE))","v":"FEHIDRO - Cobrança estadual"},{"$f":"IF(VLOOKUP(A14,Financeiro[[id_ação_Fonte_oculta]:[R$  Executado (2027)]],4,FALSE)=0,\"\",VLOOKUP(A14,Financeiro[[id_ação_Fonte_oculta]:[R$  Executado (2027)]],5,FALSE))","v":0},{"$f":"IF(VLOOKUP(A14,Financeiro[[id_ação_Fonte_oculta]:[R$  Executado (2027)]],4,FALSE)=0,\"\",VLOOKUP(A14,Financeiro[[id_ação_Fonte_oculta]:[R$  Executado (2027)]],8,FALSE))","v":1000000},{"$f":"IF(VLOOKUP(A14,Financeiro[[id_ação_Fonte_oculta]:[R$  Executado (2027)]],4,FALSE)=0,\"\",VLOOKUP(A14,Financeiro[[id_ação_Fonte_oculta]:[R$  Executado (2027)]],11,FALSE))","v":1000000},{"$f":"IF(VLOOKUP(A14,Financeiro[[id_ação_Fonte_oculta]:[R$  Executado (2027)]],4,FALSE)=0,\"\",VLOOKUP(A14,Financeiro[[id_ação_Fonte_oculta]:[R$  Executado (2027)]],14,FALSE))","v":1000000},3000000,{"$f":"IFERROR(INDEX(IdentAcoes[SubPDC],MATCH(B14,IdentAcoes[ID Ação],0)),\"\")","v":"1.2 - Planejamento"},{"$f":"IFERROR(INDEX(IdentAcoes[Prioridade do PDC],MATCH(B14,IdentAcoes[ID Ação],0)),\"\")","v":"PDC 1 e 2"},{"$f":"IFERROR(INDEX(IdentAcoes[Segmento do executor],MATCH($B14,IdentAcoes[ID Ação],0)),\"\")","v":"Município"},{"$f":"IFERROR(INDEX(IdentAcoes[Área de abrangência],MATCH($B14,IdentAcoes[ID Ação],0)),\"\")","v":"Município"},{"$f":"IFERROR(INDEX(IdentAcoes[Detalhamento da área de abrangência],MATCH($B14,IdentAcoes[ID Ação],0)),\"\")","v":"Municípios observando as prioridades no Plano de Bacias"}]
["PCJ1.1.2.2/2025FEHIDRO - Cobrança estadual","PCJ1.1.2.2/2025",{"$f":"INDEX(Financeiro[Descrição da ação],MATCH(B15,Financeiro[ID Ação], 0))","v":"Elaboração de estudos para a implantação de novas ETEs visando tratamento secundário"},{"$f":"IF(INDEX('Acompanhamento das metas 24-27'!$C$2:$C$50,MATCH(B15,'Acompanhamento das metas 24-27'!$A$2:$A$50,0))<>0,INDEX('Acompanhamento das metas 24-27'!$C$2:$C$50,MATCH(B15,'Acompanhamento das metas 24-27'!$A$2:$A$50,0)),\"\")","v":"Elaboração de ao menos 01 estudo"},{"$f":"IF(VLOOKUP(A15,Financeiro[[id_ação_Fonte_oculta]:[R$  Executado (2027)]],4,FALSE)=0,\"\",VLOOKUP(A15,Financeiro[[id_ação_Fonte_oculta]:[R$  Executado (2027)]],4,FALSE))","v":"FEHIDRO - Cobrança estadual"},{"$f":"IF(VLOOKUP(A15,Financeiro[[id_ação_Fonte_oculta]:[R$  Executado (2027)]],4,FALSE)=0,\"\",VLOOKUP(A15,Financeiro[[id_ação_Fonte_oculta]:[R$  Executado (2027)]],5,FALSE))","v":0},{"$f":"IF(VLOOKUP(A15,Financeiro[[id_ação_Fonte_oculta]:[R$  Executado (2027)]],4,FALSE)=0,\"\",VLOOKUP(A15,Financeiro[[id_ação_Fonte_oculta]:[R$  Executado (2027)]],8,FALSE))","v":1000000},{"$f":"IF(VLOOKUP(A15,Financeiro[[id_ação_Fonte_oculta]:[R$  Executado (2027)]],4,FALSE)=0,\"\",VLOOKUP(A15,Financeiro[[id_ação_Fonte_oculta]:[R$  Executado (2027)]],11,FALSE))","v":750000},{"$f":"IF(VLOOKUP(A15,Financeiro[[id_ação_Fonte_oculta]:[R$  Executado (2027)]],4,FALSE)=0,\"\",VLOOKUP(A15,Financeiro[[id_ação_Fonte_oculta]:[R$  Executado (2027)]],14,FALSE))","v":700000},2450000,{"$f":"IFERROR(INDEX(IdentAcoes[SubPDC],MATCH(B15,IdentAcoes[ID Ação],0)),\"\")","v":"1.2 - Planejamento"},{"$f":"IFERROR(INDEX(IdentAcoes[Prioridade do PDC],MATCH(B15,IdentAcoes[ID Ação],0)),\"\")","v":"PDC 1 e 2"},{"$f":"IFERROR(INDEX(IdentAcoes[Segmento do executor],MATCH($B15,IdentAcoes[ID Ação],0)),\"\")","v":"Município"},{"$f":"IFERROR(INDEX(IdentAcoes[Área de abrangência],MATCH($B15,IdentAcoes[ID Ação],0)),\"\")","v":"Município"},{"$f":"IFERROR(INDEX(IdentAcoes[Detalhamento da área de abrangência],MATCH($B15,IdentAcoes[ID Ação],0)),\"\")","v":"Municípios observando as prioridades para tratamento no Plano de Bacias"}]
["PCJ1.2.1.1/2025FEHIDRO - Cobrança estadual","PCJ1.2.1.1/2025",{"$f":"INDEX(Financeiro[Descrição da ação],MATCH(B16,Financeiro[ID Ação], 0))","v":"Elaboração de estudos de melhorias da eficiência das ETEs na remoção de nutrientes"},{"$f":"IF(INDEX('Acompanhamento das metas 24-27'!$C$2:$C$50,MATCH(B16,'Acompanhamento das metas 24-27'!$A$2:$A$50,0))<>0,INDEX('Acompanhamento das metas 24-27'!$C$2:$C$50,MATCH(B16,'Acompanhamento das metas 24-27'!$A$2:$A$50,0)),\"\")","v":"Elaboração de ao menos 01 estudo"},{"$f":"IF(VLOOKUP(A16,Financeiro[[id_ação_Fonte_oculta]:[R$  Executado (2027)]],4,FALSE)=0,\"\",VLOOKUP(A16,Financeiro[[id_ação_Fonte_oculta]:[R$  Executado (2027)]],4,FALSE))","v":"FEHIDRO - Cobrança estadual"},{"$f":"IF(VLOOKUP(A16,Financeiro[[id_ação_Fonte_oculta]:[R$  Executado (2027)]],4,FALSE)=0,\"\",VLOOKUP(A16,Financeiro[[id_ação_Fonte_oculta]:[R$  Executado (2027)]],5,FALSE))","v":0},{"$f":"IF(VLOOKUP(A16,Financeiro[[id_ação_Fonte_oculta]:[R$  Executado (2027)]],4,FALSE)=0,\"\",VLOOKUP(A16,Financeiro[[id_ação_Fonte_oculta]:[R$  Executado (2027)]],8,FALSE))","v":1000000},{"$f":"IF(VLOOKUP(A16,Financeiro[[id_ação_Fonte_oculta]:[R$  Executado (2027)]],4,FALSE)=0,\"\",VLOOKUP(A16,Financeiro[[id_ação_Fonte_oculta]:[R$  Executado (2027)]],11,FALSE))","v":1000000},{"$f":"IF(VLOOKUP(A16,Financeiro[[id_ação_Fonte_oculta]:[R$  Executado (2027)]],4,FALSE)=0,\"\",VLOOKUP(A16,Financeiro[[id_ação_Fonte_oculta]:[R$  Executado (2027)]],14,FALSE))","v":1500000},3500000,{"$f":"IFERROR(INDEX(IdentAcoes[SubPDC],MATCH(B16,IdentAcoes[ID Ação],0)),\"\")","v":"1.2 - Planejamento"},{"$f":"IFERROR(INDEX(IdentAcoes[Prioridade do PDC],MATCH(B16,IdentAcoes[ID Ação],0)),\"\")","v":"PDC 1 e 2"},{"$f":"IFERROR(INDEX(IdentAcoes[Segmento do executor],MATCH($B16,IdentAcoes[ID Ação],0)),\"\")","v":"Município"},{"$f":"IFERROR(INDEX(IdentAcoes[Área de abrangência],MATCH($B16,IdentAcoes[ID Ação],0)),\"\")","v":"Município"},{"$f":"IFERROR(INDEX(IdentAcoes[Detalhamento da área de abrangência],MATCH($B16,IdentAcoes[ID Ação],0)),\"\")","v":"Municípios observando as prioridades para remoção de nitrogênio e fósforo, no Plano de Bacias"}]
["PCJ1.1.2.4/2024FEHIDRO - Cobrança estadual","PCJ1.1.2.4/2024",{"$f":"INDEX(Financeiro[Descrição da ação],MATCH(B17,Financeiro[ID Ação], 0))","v":"Elaboração de estudos e relatórios visando o licenciamento das ETEs projetadas"},{"$f":"IF(INDEX('Acompanhamento das metas 24-27'!$C$2:$C$50,MATCH(B17,'Acompanhamento das metas 24-27'!$A$2:$A$50,0))<>0,INDEX('Acompanhamento das metas 24-27'!$C$2:$C$50,MATCH(B17,'Acompanhamento das metas 24-27'!$A$2:$A$50,0)),\"\")","v":"Elaboração de ao menos 01 estudo"},{"$f":"IF(VLOOKUP(A17,Financeiro[[id_ação_Fonte_oculta]:[R$  Executado (2027)]],4,FALSE)=0,\"\",VLOOKUP(A17,Financeiro[[id_ação_Fonte_oculta]:[R$  Executado (2027)]],4,FALSE))","v":"FEHIDRO - Cobrança estadual"},{"$f":"IF(VLOOKUP(A17,Financeiro[[id_ação_Fonte_oculta]:[R$  Executado (2027)]],4,FALSE)=0,\"\",VLOOKUP(A17,Financeiro[[id_ação_Fonte_oculta]:[R$  Executado (2027)]],5,FALSE))","v":0},{"$f":"IF(VLOOKUP(A17,Financeiro[[id_ação_Fonte_oculta]:[R$  Executado (2027)]],4,FALSE)=0,\"\",VLOOKUP(A17,Financeiro[[id_ação_Fonte_oculta]:[R$  Executado (2027)]],8,FALSE))","v":0},{"$f":"IF(VLOOKUP(A17,Financeiro[[id_ação_Fonte_oculta]:[R$  Executado (2027)]],4,FALSE)=0,\"\",VLOOKUP(A17,Financeiro[[id_ação_Fonte_oculta]:[R$  Executado (2027)]],11,FALSE))","v":0},{"$f":"IF(VLOOKUP(A17,Financeiro[[id_ação_Fonte_oculta]:[R$  Executado (2027)]],4,FALSE)=0,\"\",VLOOKUP(A17,Financeiro[[id_ação_Fonte_oculta]:[R$  Executado (2027)]],14,FALSE))","v":0},0,{"$f":"IFERROR(INDEX(IdentAcoes[SubPDC],MATCH(B17,IdentAcoes[ID Ação],0)),\"\")","v":"1.2 - Planejamento"},{"$f":"IFERROR(INDEX(IdentAcoes[Prioridade do PDC],MATCH(B17,IdentAcoes[ID Ação],0)),\"\")","v":"PDC 1 e 2"},{"$f":"IFERROR(INDEX(IdentAcoes[Segmento do executor],MATCH($B17,IdentAcoes[ID Ação],0)),\"\")","v":"Município"},{"$f":"IFERROR(INDEX(IdentAcoes[Área de abrangência],MATCH($B17,IdentAcoes[ID Ação],0)),\"\")","v":"Município"},{"$f":"IFERROR(INDEX(IdentAcoes[Detalhamento da área de abrangência],MATCH($B17,IdentAcoes[ID Ação],0)),\"\")","v":"Municípios observando as prioridades no Plano de Bacias"}]
["PCJ1.2.1.7/2024FEHIDRO - Cobrança estadual","PCJ1.2.1.7/2024",{"$f":"INDEX(Financeiro[Descrição da ação],MATCH(B18,Financeiro[ID Ação], 0))","v":"Elaboração e revisão de planos municipais de saneamento básico"},{"$f":"IF(INDEX('Acompanhamento das metas 24-27'!$C$2:$C$50,MATCH(B18,'Acompanhamento das metas 24-27'!$A$2:$A$50,0))<>0,INDEX('Acompanhamento das metas 24-27'!$C$2:$C$50,MATCH(B18,'Acompanhamento das metas 24-27'!$A$2:$A$50,0)),\"\")","v":"Ao menos 05 planos revisados/elaborados"},{"$f":"IF(VLOOKUP(A18,Financeiro[[id_ação_Fonte_oculta]:[R$  Executado (2027)]],4,FALSE)=0,\"\",VLOOKUP(A18,Financeiro[[id_ação_Fonte_oculta]:[R$  Executado (2027)]],4,FALSE))","v":"FEHIDRO - Cobrança estadual"},{"$f":"IF(VLOOKUP(A18,Financeiro[[id_ação_Fonte_oculta]:[R$  Executado (2027)]],4,FALSE)=0,\"\",VLOOKUP(A18,Financeiro[[id_ação_Fonte_oculta]:[R$  Executado (2027)]],5,FALSE))","v":2500000},{"$f":"IF(VLOOKUP(A18,Financeiro[[id_ação_Fonte_oculta]:[R$  Executado (2027)]],4,FALSE)=0,\"\",VLOOKUP(A18,Financeiro[[id_ação_Fonte_oculta]:[R$  Executado (2027)]],8,FALSE))","v":1750000},{"$f":"IF(VLOOKUP(A18,Financeiro[[id_ação_Fonte_oculta]:[R$  Executado (2027)]],4,FALSE)=0,\"\",VLOOKUP(A18,Financeiro[[id_ação_Fonte_oculta]:[R$  Executado (2027)]],11,FALSE))","v":1750000},{"$f":"IF(VLOOKUP(A18,Financeiro[[id_ação_Fonte_oculta]:[R$  Executado (2027)]],4,FALSE)=0,\"\",VLOOKUP(A18,Financeiro[[id_ação_Fonte_oculta]:[R$  Executado (2027)]],14,FALSE))","v":1750000},7750000,{"$f":"IFERROR(INDEX(IdentAcoes[SubPDC],MATCH(B18,IdentAcoes[ID Ação],0)),\"\")","v":"1.2 - Planejamento"},{"$f":"IFERROR(INDEX(IdentAcoes[Prioridade do PDC],MATCH(B18,IdentAcoes[ID Ação],0)),\"\")","v":"PDC 1 e 2"},{"$f":"IFERROR(INDEX(IdentAcoes[Segmento do executor],MATCH($B18,IdentAcoes[ID Ação],0)),\"\")","v":"Município"},{"$f":"IFERROR(INDEX(IdentAcoes[Área de abrangência],MATCH($B18,IdentAcoes[ID Ação],0)),\"\")","v":"Município"},{"$f":"IFERROR(INDEX(IdentAcoes[Detalhamento da área de abrangência],MATCH($B18,IdentAcoes[ID Ação],0)),\"\")","v":"Municípios observando as prioridades no Plano de Bacias"}]
["PCJ2.3.2.1/2024FEHIDRO - Cobrança estadual","PCJ2.3.2.1/2024",{"$f":"INDEX(Financeiro[Descrição da ação],MATCH(B19,Financeiro[ID Ação], 0))","v":"Elaboração e revisão de Planos de Controle e Redução de Perdas"},{"$f":"IF(INDEX('Acompanhamento das metas 24-27'!$C$2:$C$50,MATCH(B19,'Acompanhamento das metas 24-27'!$A$2:$A$50,0))<>0,INDEX('Acompanhamento das metas 24-27'!$C$2:$C$50,MATCH(B19,'Acompanhamento das metas 24-27'!$A$2:$A$50,0)),\"\")","v":"Ao menos 05 planos revisados/elaborados"},{"$f":"IF(VLOOKUP(A19,Financeiro[[id_ação_Fonte_oculta]:[R$  Executado (2027)]],4,FALSE)=0,\"\",VLOOKUP(A19,Financeiro[[id_ação_Fonte_oculta]:[R$  Executado (2027)]],4,FALSE))","v":"FEHIDRO - Cobrança estadual"},{"$f":"IF(VLOOKUP(A19,Financeiro[[id_ação_Fonte_oculta]:[R$  Executado (2027)]],4,FALSE)=0,\"\",VLOOKUP(A19,Financeiro[[id_ação_Fonte_oculta]:[R$  Executado (2027)]],5,FALSE))","v":1500000},{"$f":"IF(VLOOKUP(A19,Financeiro[[id_ação_Fonte_oculta]:[R$  Executado (2027)]],4,FALSE)=0,\"\",VLOOKUP(A19,Financeiro[[id_ação_Fonte_oculta]:[R$  Executado (2027)]],8,FALSE))","v":1750000},{"$f":"IF(VLOOKUP(A19,Financeiro[[id_ação_Fonte_oculta]:[R$  Executado (2027)]],4,FALSE)=0,\"\",VLOOKUP(A19,Financeiro[[id_ação_Fonte_oculta]:[R$  Executado (2027)]],11,FALSE))","v":1250000},{"$f":"IF(VLOOKUP(A19,Financeiro[[id_ação_Fonte_oculta]:[R$  Executado (2027)]],4,FALSE)=0,\"\",VLOOKUP(A19,Financeiro[[id_ação_Fonte_oculta]:[R$  Executado (2027)]],14,FALSE))","v":1250000},5750000,{"$f":"IFERROR(INDEX(IdentAcoes[SubPDC],MATCH(B19,IdentAcoes[ID Ação],0)),\"\")","v":"1.2 - Planejamento"},{"$f":"IFERROR(INDEX(IdentAcoes[Prioridade do PDC],MATCH(B19,IdentAcoes[ID Ação],0)),\"\")","v":"PDC 1 e 2"},{"$f":"IFERROR(INDEX(IdentAcoes[Segmento do executor],MATCH($B19,IdentAcoes[ID Ação],0)),\"\")","v":"Município"},{"$f":"IFERROR(INDEX(IdentAcoes[Área de abrangência],MATCH($B19,IdentAcoes[ID Ação],0)),\"\")","v":"Município"},{"$f":"IFERROR(INDEX(IdentAcoes[Detalhamento da área de abrangência],MATCH($B19,IdentAcoes[ID Ação],0)),\"\")","v":"Municípios observando as prioridades no Plano de Bacias"}]
["PCJ2.2.4.1/2024FEHIDRO - Cobrança estadual","PCJ2.2.4.1/2024",{"$f":"INDEX(Financeiro[Descrição da ação],MATCH(B20,Financeiro[ID Ação], 0))","v":"Desenvolvimento de estudo de alternativas de aumento da disponibilidade hídrica nas sub-bacias dos rios Atibaia, Jundiaí e Capivari"},{"$f":"IF(INDEX('Acompanhamento das metas 24-27'!$C$2:$C$50,MATCH(B20,'Acompanhamento das metas 24-27'!$A$2:$A$50,0))<>0,INDEX('Acompanhamento das metas 24-27'!$C$2:$C$50,MATCH(B20,'Acompanhamento das metas 24-27'!$A$2:$A$50,0)),\"\")","v":"Ao menos 01 estudo elaborado"},{"$f":"IF(VLOOKUP(A20,Financeiro[[id_ação_Fonte_oculta]:[R$  Executado (2027)]],4,FALSE)=0,\"\",VLOOKUP(A20,Financeiro[[id_ação_Fonte_oculta]:[R$  Executado (2027)]],4,FALSE))","v":"FEHIDRO - Cobrança estadual"},{"$f":"IF(VLOOKUP(A20,Financeiro[[id_ação_Fonte_oculta]:[R$  Executado (2027)]],4,FALSE)=0,\"\",VLOOKUP(A20,Financeiro[[id_ação_Fonte_oculta]:[R$  Executado (2027)]],5,FALSE))","v":1500000},{"$f":"IF(VLOOKUP(A20,Financeiro[[id_ação_Fonte_oculta]:[R$  Executado (2027)]],4,FALSE)=0,\"\",VLOOKUP(A20,Financeiro[[id_ação_Fonte_oculta]:[R$  Executado (2027)]],8,FALSE))","v":0},{"$f":"IF(VLOOKUP(A20,Financeiro[[id_ação_Fonte_oculta]:[R$  Executado (2027)]],4,FALSE)=0,\"\",VLOOKUP(A20,Financeiro[[id_ação_Fonte_oculta]:[R$  Executado (2027)]],11,FALSE))","v":0},{"$f":"IF(VLOOKUP(A20,Financeiro[[id_ação_Fonte_oculta]:[R$  Executado (2027)]],4,FALSE)=0,\"\",VLOOKUP(A20,Financeiro[[id_ação_Fonte_oculta]:[R$  Executado (2027)]],14,FALSE))","v":0},1500000,{"$f":"IFERROR(INDEX(IdentAcoes[SubPDC],MATCH(B20,IdentAcoes[ID Ação],0)),\"\")","v":"1.2 - Planejamento"},{"$f":"IFERROR(INDEX(IdentAcoes[Prioridade do PDC],MATCH(B20,IdentAcoes[ID Ação],0)),\"\")","v":"PDC 1 e 2"},{"$f":"IFERROR(INDEX(IdentAcoes[Segmento do executor],MATCH($B20,IdentAcoes[ID Ação],0)),\"\")","v":"Sociedade Civil"},{"$f":"IFERROR(INDEX(IdentAcoes[Área de abrangência],MATCH($B20,IdentAcoes[ID Ação],0)),\"\")","v":"Sub-bacia"},{"$f":"IFERROR(INDEX(IdentAcoes[Detalhamento da área de abrangência],MATCH($B20,IdentAcoes[ID Ação],0)),\"\")","v":"Sub-bacias Atibaia, Jundiaí e Capivari"}]
["PCJ4.2.1.1/2026FEHIDRO - Cobrança estadual","PCJ4.2.1.1/2026",{"$f":"INDEX(Financeiro[Descrição da ação],MATCH(B21,Financeiro[ID Ação], 0))","v":"Desenvolver estudo regional hidrogeológico nas Bacias PCJ"},{"$f":"IF(INDEX('Acompanhamento das metas 24-27'!$C$2:$C$50,MATCH(B21,'Acompanhamento das metas 24-27'!$A$2:$A$50,0))<>0,INDEX('Acompanhamento das metas 24-27'!$C$2:$C$50,MATCH(B21,'Acompanhamento das metas 24-27'!$A$2:$A$50,0)),\"\")","v":"1. Desenvolvimento de termos de referência com arranjos institucionais e operacionais definidos; 2. Estudo desenvolvido e incorporado às práticas de gestão; 3. Validação por parte da CT-AS."},{"$f":"IF(VLOOKUP(A21,Financeiro[[id_ação_Fonte_oculta]:[R$  Executado (2027)]],4,FALSE)=0,\"\",VLOOKUP(A21,Financeiro[[id_ação_Fonte_oculta]:[R$  Executado (2027)]],4,FALSE))","v":"FEHIDRO - Cobrança estadual"},{"$f":"IF(VLOOKUP(A21,Financeiro[[id_ação_Fonte_oculta]:[R$  Executado (2027)]],4,FALSE)=0,\"\",VLOOKUP(A21,Financeiro[[id_ação_Fonte_oculta]:[R$  Executado (2027)]],5,FALSE))","v":0},{"$f":"IF(VLOOKUP(A21,Financeiro[[id_ação_Fonte_oculta]:[R$  Executado (2027)]],4,FALSE)=0,\"\",VLOOKUP(A21,Financeiro[[id_ação_Fonte_oculta]:[R$  Executado (2027)]],8,FALSE))","v":0},{"$f":"IF(VLOOKUP(A21,Financeiro[[id_ação_Fonte_oculta]:[R$  Executado (2027)]],4,FALSE)=0,\"\",VLOOKUP(A21,Financeiro[[id_ação_Fonte_oculta]:[R$  Executado (2027)]],11,FALSE))","v":2000000},{"$f":"IF(VLOOKUP(A21,Financeiro[[id_ação_Fonte_oculta]:[R$  Executado (2027)]],4,FALSE)=0,\"\",VLOOKUP(A21,Financeiro[[id_ação_Fonte_oculta]:[R$  Executado (2027)]],14,FALSE))","v":0},2000000,{"$f":"IFERROR(INDEX(IdentAcoes[SubPDC],MATCH(B21,IdentAcoes[ID Ação],0)),\"\")","v":"1.2 - Planejamento"},{"$f":"IFERROR(INDEX(IdentAcoes[Prioridade do PDC],MATCH(B21,IdentAcoes[ID Ação],0)),\"\")","v":"PDC 1 e 2"},{"$f":"IFERROR(INDEX(IdentAcoes[Segmento do executor],MATCH($B21,IdentAcoes[ID Ação],0)),\"\")","v":"Sociedade Civil"},{"$f":"IFERROR(INDEX(IdentAcoes[Área de abrangência],MATCH($B21,IdentAcoes[ID Ação],0)),\"\")","v":"Bacia"},{"$f":"IFERROR(INDEX(IdentAcoes[Detalhamento da área de abrangência],MATCH($B21,IdentAcoes[ID Ação],0)),\"\")","v":"Bacias PCJ"}]
["PCJ4.2.1.2/2026FEHIDRO - Cobrança estadual","PCJ4.2.1.2/2026",{"$f":"INDEX(Financeiro[Descrição da ação],MATCH(B22,Financeiro[ID Ação], 0))","v":"Desenvolvimento de estudo para estimativa de balanços hídricos e recargas nas Bacias PCJ"},{"$f":"IF(INDEX('Acompanhamento das metas 24-27'!$C$2:$C$50,MATCH(B22,'Acompanhamento das metas 24-27'!$A$2:$A$50,0))<>0,INDEX('Acompanhamento das metas 24-27'!$C$2:$C$50,MATCH(B22,'Acompanhamento das metas 24-27'!$A$2:$A$50,0)),\"\")","v":"1. Termos de referência desenvolvidos com arranjos institucionais e operacionais definidos; 2. Estudo desenvolvido e incorporado às práticas de gestão; 3. Validação por parte da CT-AS"},{"$f":"IF(VLOOKUP(A22,Financeiro[[id_ação_Fonte_oculta]:[R$  Executado (2027)]],4,FALSE)=0,\"\",VLOOKUP(A22,Financeiro[[id_ação_Fonte_oculta]:[R$  Executado (2027)]],4,FALSE))","v":"FEHIDRO - Cobrança estadual"},{"$f":"IF(VLOOKUP(A22,Financeiro[[id_ação_Fonte_oculta]:[R$  Executado (2027)]],4,FALSE)=0,\"\",VLOOKUP(A22,Financeiro[[id_ação_Fonte_oculta]:[R$  Executado (2027)]],5,FALSE))","v":0},{"$f":"IF(VLOOKUP(A22,Financeiro[[id_ação_Fonte_oculta]:[R$  Executado (2027)]],4,FALSE)=0,\"\",VLOOKUP(A22,Financeiro[[id_ação_Fonte_oculta]:[R$  Executado (2027)]],8,FALSE))","v":0},{"$f":"IF(VLOOKUP(A22,Financeiro[[id_ação_Fonte_oculta]:[R$  Executado (2027)]],4,FALSE)=0,\"\",VLOOKUP(A22,Financeiro[[id_ação_Fonte_oculta]:[R$  Executado (2027)]],11,FALSE))","v":2250000},{"$f":"IF(VLOOKUP(A22,Financeiro[[id_ação_Fonte_oculta]:[R$  Executado (2027)]],4,FALSE)=0,\"\",VLOOKUP(A22,Financeiro[[id_ação_Fonte_oculta]:[R$  Executado (2027)]],14,FALSE))","v":0},2250000,{"$f":"IFERROR(INDEX(IdentAcoes[SubPDC],MATCH(B22,IdentAcoes[ID Ação],0)),\"\")","v":"1.2 - Planejamento"},{"$f":"IFERROR(INDEX(IdentAcoes[Prioridade do PDC],MATCH(B22,IdentAcoes[ID Ação],0)),\"\")","v":"PDC 1 e 2"},{"$f":"IFERROR(INDEX(IdentAcoes[Segmento do executor],MATCH($B22,IdentAcoes[ID Ação],0)),\"\")","v":"Sociedade Civil"},{"$f":"IFERROR(INDEX(IdentAcoes[Área de abrangência],MATCH($B22,IdentAcoes[ID Ação],0)),\"\")","v":"Bacia"},{"$f":"IFERROR(INDEX(IdentAcoes[Detalhamento da área de abrangência],MATCH($B22,IdentAcoes[ID Ação],0)),\"\")","v":"Bacias PCJ"}]
["PCJ4.2.1.3/2027FEHIDRO - Cobrança estadual","PCJ4.2.1.3/2027",{"$f":"INDEX(Financeiro[Descrição da ação],MATCH(B23,Financeiro[ID Ação], 0))","v":"Delimitar as principais áreas de recarga e estabelecer diretrizes de proteção"},{"$f":"IF(INDEX('Acompanhamento das metas 24-27'!$C$2:$C$50,MATCH(B23,'Acompanhamento das metas 24-27'!$A$2:$A$50,0))<>0,INDEX('Acompanhamento das metas 24-27'!$C$2:$C$50,MATCH(B23,'Acompanhamento das metas 24-27'!$A$2:$A$50,0)),\"\")","v":"1. Termos de referência desenvolvidos com arranjos operacionais definidos; 2. Estudo desenvolvido com mapas e diretrizes de proteção; 3. Validação por parte da CT-AS"},{"$f":"IF(VLOOKUP(A23,Financeiro[[id_ação_Fonte_oculta]:[R$  Executado (2027)]],4,FALSE)=0,\"\",VLOOKUP(A23,Financeiro[[id_ação_Fonte_oculta]:[R$  Executado (2027)]],4,FALSE))","v":"FEHIDRO - Cobrança estadual"},{"$f":"IF(VLOOKUP(A23,Financeiro[[id_ação_Fonte_oculta]:[R$  Executado (2027)]],4,FALSE)=0,\"\",VLOOKUP(A23,Financeiro[[id_ação_Fonte_oculta]:[R$  Executado (2027)]],5,FALSE))","v":0},{"$f":"IF(VLOOKUP(A23,Financeiro[[id_ação_Fonte_oculta]:[R$  Executado (2027)]],4,FALSE)=0,\"\",VLOOKUP(A23,Financeiro[[id_ação_Fonte_oculta]:[R$  Executado (2027)]],8,FALSE))","v":0},{"$f":"IF(VLOOKUP(A23,Financeiro[[id_ação_Fonte_oculta]:[R$  Executado (2027)]],4,FALSE)=0,\"\",VLOOKUP(A23,Financeiro[[id_ação_Fonte_oculta]:[R$  Executado (2027)]],11,FALSE))","v":0},{"$f":"IF(VLOOKUP(A23,Financeiro[[id_ação_Fonte_oculta]:[R$  Executado (2027)]],4,FALSE)=0,\"\",VLOOKUP(A23,Financeiro[[id_ação_Fonte_oculta]:[R$  Executado (2027)]],14,FALSE))","v":2550000},2550000,{"$f":"IFERROR(INDEX(IdentAcoes[SubPDC],MATCH(B23,IdentAcoes[ID Ação],0)),\"\")","v":"1.2 - Planejamento"},{"$f":"IFERROR(INDEX(IdentAcoes[Prioridade do PDC],MATCH(B23,IdentAcoes[ID Ação],0)),\"\")","v":"PDC 1 e 2"},{"$f":"IFERROR(INDEX(IdentAcoes[Segmento do executor],MATCH($B23,IdentAcoes[ID Ação],0)),\"\")","v":"Sociedade Civil"},{"$f":"IFERROR(INDEX(IdentAcoes[Área de abrangência],MATCH($B23,IdentAcoes[ID Ação],0)),\"\")","v":"Bacia"},{"$f":"IFERROR(INDEX(IdentAcoes[Detalhamento da área de abrangência],MATCH($B23,IdentAcoes[ID Ação],0)),\"\")","v":"Bacias PCJ"}]
["PCJ4.2.2.1/2027FEHIDRO - Cobrança estadual","PCJ4.2.2.1/2027",{"$f":"INDEX(Financeiro[Descrição da ação],MATCH(B24,Financeiro[ID Ação], 0))","v":"Elaboração do estudo hidrogeológico do aquífero Tubarão"},{"$f":"IF(INDEX('Acompanhamento das metas 24-27'!$C$2:$C$50,MATCH(B24,'Acompanhamento das metas 24-27'!$A$2:$A$50,0))<>0,INDEX('Acompanhamento das metas 24-27'!$C$2:$C$50,MATCH(B24,'Acompanhamento das metas 24-27'!$A$2:$A$50,0)),\"\")","v":"1. Realizar levantamentos e diagnósticos; 2. Definir e atualizar o modelo hidrogeológico conceitual; 3. Desenvolver modelos matemáticos; 4. Propor diretrizes para gestão de água subterrânea"},{"$f":"IF(VLOOKUP(A24,Financeiro[[id_ação_Fonte_oculta]:[R$  Executado (2027)]],4,FALSE)=0,\"\",VLOOKUP(A24,Financeiro[[id_ação_Fonte_oculta]:[R$  Executado (2027)]],4,FALSE))","v":"FEHIDRO - Cobrança estadual"},{"$f":"IF(VLOOKUP(A24,Financeiro[[id_ação_Fonte_oculta]:[R$  Executado (2027)]],4,FALSE)=0,\"\",VLOOKUP(A24,Financeiro[[id_ação_Fonte_oculta]:[R$  Executado (2027)]],5,FALSE))","v":0},{"$f":"IF(VLOOKUP(A24,Financeiro[[id_ação_Fonte_oculta]:[R$  Executado (2027)]],4,FALSE)=0,\"\",VLOOKUP(A24,Financeiro[[id_ação_Fonte_oculta]:[R$  Executado (2027)]],8,FALSE))","v":0},{"$f":"IF(VLOOKUP(A24,Financeiro[[id_ação_Fonte_oculta]:[R$  Executado (2027)]],4,FALSE)=0,\"\",VLOOKUP(A24,Financeiro[[id_ação_Fonte_oculta]:[R$  Executado (2027)]],11,FALSE))","v":0},{"$f":"IF(VLOOKUP(A24,Financeiro[[id_ação_Fonte_oculta]:[R$  Executado (2027)]],4,FALSE)=0,\"\",VLOOKUP(A24,Financeiro[[id_ação_Fonte_oculta]:[R$  Executado (2027)]],14,FALSE))","v":1200000},1200000,{"$f":"IFERROR(INDEX(IdentAcoes[SubPDC],MATCH(B24,IdentAcoes[ID Ação],0)),\"\")","v":"1.2 - Planejamento"},{"$f":"IFERROR(INDEX(IdentAcoes[Prioridade do PDC],MATCH(B24,IdentAcoes[ID Ação],0)),\"\")","v":"PDC 1 e 2"},{"$f":"IFERROR(INDEX(IdentAcoes[Segmento do executor],MATCH($B24,IdentAcoes[ID Ação],0)),\"\")","v":"Sociedade Civil"},{"$f":"IFERROR(INDEX(IdentAcoes[Área de abrangência],MATCH($B24,IdentAcoes[ID Ação],0)),\"\")","v":"Bacia"},{"$f":"IFERROR(INDEX(IdentAcoes[Detalhamento da área de abrangência],MATCH($B24,IdentAcoes[ID Ação],0)),\"\")","v":"Bacias PCJ"}]
["PCJ6.3.1.4/2025FEHIDRO - Cobrança estadual","PCJ6.3.1.4/2025",{"$f":"INDEX(Financeiro[Descrição da ação],MATCH(B25,Financeiro[ID Ação], 0))","v":"Estabelecer parcerias para pesquisa com universidade e institutos"},{"$f":"IF(INDEX('Acompanhamento das metas 24-27'!$C$2:$C$50,MATCH(B25,'Acompanhamento das metas 24-27'!$A$2:$A$50,0))<>0,INDEX('Acompanhamento das metas 24-27'!$C$2:$C$50,MATCH(B25,'Acompanhamento das metas 24-27'!$A$2:$A$50,0)),\"\")","v":"Ao menos 01 parceria firmada"},{"$f":"IF(VLOOKUP(A25,Financeiro[[id_ação_Fonte_oculta]:[R$  Executado (2027)]],4,FALSE)=0,\"\",VLOOKUP(A25,Financeiro[[id_ação_Fonte_oculta]:[R$  Executado (2027)]],4,FALSE))","v":"FEHIDRO - Cobrança estadual"},{"$f":"IF(VLOOKUP(A25,Financeiro[[id_ação_Fonte_oculta]:[R$  Executado (2027)]],4,FALSE)=0,\"\",VLOOKUP(A25,Financeiro[[id_ação_Fonte_oculta]:[R$  Executado (2027)]],5,FALSE))","v":0},{"$f":"IF(VLOOKUP(A25,Financeiro[[id_ação_Fonte_oculta]:[R$  Executado (2027)]],4,FALSE)=0,\"\",VLOOKUP(A25,Financeiro[[id_ação_Fonte_oculta]:[R$  Executado (2027)]],8,FALSE))","v":71428.56},{"$f":"IF(VLOOKUP(A25,Financeiro[[id_ação_Fonte_oculta]:[R$  Executado (2027)]],4,FALSE)=0,\"\",VLOOKUP(A25,Financeiro[[id_ação_Fonte_oculta]:[R$  Executado (2027)]],11,FALSE))","v":0},{"$f":"IF(VLOOKUP(A25,Financeiro[[id_ação_Fonte_oculta]:[R$  Executado (2027)]],4,FALSE)=0,\"\",VLOOKUP(A25,Financeiro[[id_ação_Fonte_oculta]:[R$  Executado (2027)]],14,FALSE))","v":0},71428.56,{"$f":"IFERROR(INDEX(IdentAcoes[SubPDC],MATCH(B25,IdentAcoes[ID Ação],0)),\"\")","v":"1.2 - Planejamento"},{"$f":"IFERROR(INDEX(IdentAcoes[Prioridade do PDC],MATCH(B25,IdentAcoes[ID Ação],0)),\"\")","v":"PDC 1 e 2"},{"$f":"IFERROR(INDEX(IdentAcoes[Segmento do executor],MATCH($B25,IdentAcoes[ID Ação],0)),\"\")","v":"Sociedade Civil"},{"$f":"IFERROR(INDEX(IdentAcoes[Área de abrangência],MATCH($B25,IdentAcoes[ID Ação],0)),\"\")","v":"Bacia"},{"$f":"IFERROR(INDEX(IdentAcoes[Detalhamento da área de abrangência],MATCH($B25,IdentAcoes[ID Ação],0)),\"\")","v":"Bacias PCJ"}]
["PCJ4.1.1.2/2027FEHIDRO - Cobrança estadual","PCJ4.1.1.2/2027",{"$f":"INDEX(Financeiro[Descrição da ação],MATCH(B26,Financeiro[ID Ação], 0))","v":"Desenvolvimento de banco de dados de poços e suporte à decisão"},{"$f":"IF(INDEX('Acompanhamento das metas 24-27'!$C$2:$C$50,MATCH(B26,'Acompanhamento das metas 24-27'!$A$2:$A$50,0))<>0,INDEX('Acompanhamento das metas 24-27'!$C$2:$C$50,MATCH(B26,'Acompanhamento das metas 24-27'!$A$2:$A$50,0)),\"\")","v":"Ao menos 01 banco de dados"},{"$f":"IF(VLOOKUP(A26,Financeiro[[id_ação_Fonte_oculta]:[R$  Executado (2027)]],4,FALSE)=0,\"\",VLOOKUP(A26,Financeiro[[id_ação_Fonte_oculta]:[R$  Executado (2027)]],4,FALSE))","v":"FEHIDRO - Cobrança estadual"},{"$f":"IF(VLOOKUP(A26,Financeiro[[id_ação_Fonte_oculta]:[R$  Executado (2027)]],4,FALSE)=0,\"\",VLOOKUP(A26,Financeiro[[id_ação_Fonte_oculta]:[R$  Executado (2027)]],5,FALSE))","v":0},{"$f":"IF(VLOOKUP(A26,Financeiro[[id_ação_Fonte_oculta]:[R$  Executado (2027)]],4,FALSE)=0,\"\",VLOOKUP(A26,Financeiro[[id_ação_Fonte_oculta]:[R$  Executado (2027)]],8,FALSE))","v":0},{"$f":"IF(VLOOKUP(A26,Financeiro[[id_ação_Fonte_oculta]:[R$  Executado (2027)]],4,FALSE)=0,\"\",VLOOKUP(A26,Financeiro[[id_ação_Fonte_oculta]:[R$  Executado (2027)]],11,FALSE))","v":0},{"$f":"IF(VLOOKUP(A26,Financeiro[[id_ação_Fonte_oculta]:[R$  Executado (2027)]],4,FALSE)=0,\"\",VLOOKUP(A26,Financeiro[[id_ação_Fonte_oculta]:[R$  Executado (2027)]],14,FALSE))","v":1500000},1500000,{"$f":"IFERROR(INDEX(IdentAcoes[SubPDC],MATCH(B26,IdentAcoes[ID Ação],0)),\"\")","v":"2.2 - Outorga"},{"$f":"IFERROR(INDEX(IdentAcoes[Prioridade do PDC],MATCH(B26,IdentAcoes[ID Ação],0)),\"\")","v":"PDC 1 e 2"},{"$f":"IFERROR(INDEX(IdentAcoes[Segmento do executor],MATCH($B26,IdentAcoes[ID Ação],0)),\"\")","v":"Estado"},{"$f":"IFERROR(INDEX(IdentAcoes[Área de abrangência],MATCH($B26,IdentAcoes[ID Ação],0)),\"\")","v":"Bacia"},{"$f":"IFERROR(INDEX(IdentAcoes[Detalhamento da área de abrangência],MATCH($B26,IdentAcoes[ID Ação],0)),\"\")","v":"Bacias PCJ"}]
["PCJ6.2.5.1/2024FEHIDRO - Cobrança estadual","PCJ6.2.5.1/2024",{"$f":"INDEX(Financeiro[Descrição da ação],MATCH(B27,Financeiro[ID Ação], 0))","v":"Desenvolvimento de um plano de fiscalização de Outorgas em apoio ao órgão gestor "},{"$f":"IF(INDEX('Acompanhamento das metas 24-27'!$C$2:$C$50,MATCH(B27,'Acompanhamento das metas 24-27'!$A$2:$A$50,0))<>0,INDEX('Acompanhamento das metas 24-27'!$C$2:$C$50,MATCH(B27,'Acompanhamento das metas 24-27'!$A$2:$A$50,0)),\"\")","v":"1. Arranjo institucional formalizado; 2. Plano elaborado e executado; 3. Aumento da agilidade e precisão técnica na concessão de outorgas e maior efetividade da fiscalização"},{"$f":"IF(VLOOKUP(A27,Financeiro[[id_ação_Fonte_oculta]:[R$  Executado (2027)]],4,FALSE)=0,\"\",VLOOKUP(A27,Financeiro[[id_ação_Fonte_oculta]:[R$  Executado (2027)]],4,FALSE))","v":"FEHIDRO - Cobrança estadual"},{"$f":"IF(VLOOKUP(A27,Financeiro[[id_ação_Fonte_oculta]:[R$  Executado (2027)]],4,FALSE)=0,\"\",VLOOKUP(A27,Financeiro[[id_ação_Fonte_oculta]:[R$  Executado (2027)]],5,FALSE))","v":0},{"$f":"IF(VLOOKUP(A27,Financeiro[[id_ação_Fonte_oculta]:[R$  Executado (2027)]],4,FALSE)=0,\"\",VLOOKUP(A27,Financeiro[[id_ação_Fonte_oculta]:[R$  Executado (2027)]],8,FALSE))","v":0},{"$f":"IF(VLOOKUP(A27,Financeiro[[id_ação_Fonte_oculta]:[R$  Executado (2027)]],4,FALSE)=0,\"\",VLOOKUP(A27,Financeiro[[id_ação_Fonte_oculta]:[R$  Executado (2027)]],11,FALSE))","v":0},{"$f":"IF(VLOOKUP(A27,Financeiro[[id_ação_Fonte_oculta]:[R$  Executado (2027)]],4,FALSE)=0,\"\",VLOOKUP(A27,Financeiro[[id_ação_Fonte_oculta]:[R$  Executado (2027)]],14,FALSE))","v":0},0,{"$f":"IFERROR(INDEX(IdentAcoes[SubPDC],MATCH(B27,IdentAcoes[ID Ação],0)),\"\")","v":"2.2 - Outorga"},{"$f":"IFERROR(INDEX(IdentAcoes[Prioridade do PDC],MATCH(B27,IdentAcoes[ID Ação],0)),\"\")","v":"PDC 1 e 2"},{"$f":"IFERROR(INDEX(IdentAcoes[Segmento do executor],MATCH($B27,IdentAcoes[ID Ação],0)),\"\")","v":"Estado"},{"$f":"IFERROR(INDEX(IdentAcoes[Área de abrangência],MATCH($B27,IdentAcoes[ID Ação],0)),\"\")","v":"Bacia"},{"$f":"IFERROR(INDEX(IdentAcoes[Detalhamento da área de abrangência],MATCH($B27,IdentAcoes[ID Ação],0)),\"\")","v":"Bacias PCJ"}]
["PCJ6.2.3.2/2026FEHIDRO - Cobrança estadual","PCJ6.2.3.2/2026",{"$f":"INDEX(Financeiro[Descrição da ação],MATCH(B28,Financeiro[ID Ação], 0))","v":"Monitoramento de chuva, vazão, qualidade e nível de água subterrânea em pequenas bacias hidrográficas"},{"$f":"IF(INDEX('Acompanhamento das metas 24-27'!$C$2:$C$50,MATCH(B28,'Acompanhamento das metas 24-27'!$A$2:$A$50,0))<>0,INDEX('Acompanhamento das metas 24-27'!$C$2:$C$50,MATCH(B28,'Acompanhamento das metas 24-27'!$A$2:$A$50,0)),\"\")","v":"1. Projeto da rede; 2. Implementação da rede; 3. Operação da rede; "},{"$f":"IF(VLOOKUP(A28,Financeiro[[id_ação_Fonte_oculta]:[R$  Executado (2027)]],4,FALSE)=0,\"\",VLOOKUP(A28,Financeiro[[id_ação_Fonte_oculta]:[R$  Executado (2027)]],4,FALSE))","v":"FEHIDRO - Cobrança estadual"},{"$f":"IF(VLOOKUP(A28,Financeiro[[id_ação_Fonte_oculta]:[R$  Executado (2027)]],4,FALSE)=0,\"\",VLOOKUP(A28,Financeiro[[id_ação_Fonte_oculta]:[R$  Executado (2027)]],5,FALSE))","v":0},{"$f":"IF(VLOOKUP(A28,Financeiro[[id_ação_Fonte_oculta]:[R$  Executado (2027)]],4,FALSE)=0,\"\",VLOOKUP(A28,Financeiro[[id_ação_Fonte_oculta]:[R$  Executado (2027)]],8,FALSE))","v":0},{"$f":"IF(VLOOKUP(A28,Financeiro[[id_ação_Fonte_oculta]:[R$  Executado (2027)]],4,FALSE)=0,\"\",VLOOKUP(A28,Financeiro[[id_ação_Fonte_oculta]:[R$  Executado (2027)]],11,FALSE))","v":1000000},{"$f":"IF(VLOOKUP(A28,Financeiro[[id_ação_Fonte_oculta]:[R$  Executado (2027)]],4,FALSE)=0,\"\",VLOOKUP(A28,Financeiro[[id_ação_Fonte_oculta]:[R$  Executado (2027)]],14,FALSE))","v":1200000},2200000,{"$f":"IFERROR(INDEX(IdentAcoes[SubPDC],MATCH(B28,IdentAcoes[ID Ação],0)),\"\")","v":"2.5 - Redes de monitoramento e SI"},{"$f":"IFERROR(INDEX(IdentAcoes[Prioridade do PDC],MATCH(B28,IdentAcoes[ID Ação],0)),\"\")","v":"PDC 1 e 2"},{"$f":"IFERROR(INDEX(IdentAcoes[Segmento do executor],MATCH($B28,IdentAcoes[ID Ação],0)),\"\")","v":"Sociedade Civil"},{"$f":"IFERROR(INDEX(IdentAcoes[Área de abrangência],MATCH($B28,IdentAcoes[ID Ação],0)),\"\")","v":"Bacia"},{"$f":"IFERROR(INDEX(IdentAcoes[Detalhamento da área de abrangência],MATCH($B28,IdentAcoes[ID Ação],0)),\"\")","v":"Bacias PCJ"}]
["PCJ6.2.3.3/2026FEHIDRO - Cobrança estadual","PCJ6.2.3.3/2026",{"$f":"INDEX(Financeiro[Descrição da ação],MATCH(B29,Financeiro[ID Ação], 0))","v":"Implantação, integração, operação e manutenção da rede de monitoramento quali-quantitativo das águas subterrâneas"},{"$f":"IF(INDEX('Acompanhamento das metas 24-27'!$C$2:$C$50,MATCH(B29,'Acompanhamento das metas 24-27'!$A$2:$A$50,0))<>0,INDEX('Acompanhamento das metas 24-27'!$C$2:$C$50,MATCH(B29,'Acompanhamento das metas 24-27'!$A$2:$A$50,0)),\"\")","v":"Disponibilização dos dados de ao menos 02 postos ativos "},{"$f":"IF(VLOOKUP(A29,Financeiro[[id_ação_Fonte_oculta]:[R$  Executado (2027)]],4,FALSE)=0,\"\",VLOOKUP(A29,Financeiro[[id_ação_Fonte_oculta]:[R$  Executado (2027)]],4,FALSE))","v":"FEHIDRO - Cobrança estadual"},{"$f":"IF(VLOOKUP(A29,Financeiro[[id_ação_Fonte_oculta]:[R$  Executado (2027)]],4,FALSE)=0,\"\",VLOOKUP(A29,Financeiro[[id_ação_Fonte_oculta]:[R$  Executado (2027)]],5,FALSE))","v":0},{"$f":"IF(VLOOKUP(A29,Financeiro[[id_ação_Fonte_oculta]:[R$  Executado (2027)]],4,FALSE)=0,\"\",VLOOKUP(A29,Financeiro[[id_ação_Fonte_oculta]:[R$  Executado (2027)]],8,FALSE))","v":0},{"$f":"IF(VLOOKUP(A29,Financeiro[[id_ação_Fonte_oculta]:[R$  Executado (2027)]],4,FALSE)=0,\"\",VLOOKUP(A29,Financeiro[[id_ação_Fonte_oculta]:[R$  Executado (2027)]],11,FALSE))","v":1000000},{"$f":"IF(VLOOKUP(A29,Financeiro[[id_ação_Fonte_oculta]:[R$  Executado (2027)]],4,FALSE)=0,\"\",VLOOKUP(A29,Financeiro[[id_ação_Fonte_oculta]:[R$  Executado (2027)]],14,FALSE))","v":0},1000000,{"$f":"IFERROR(INDEX(IdentAcoes[SubPDC],MATCH(B29,IdentAcoes[ID Ação],0)),\"\")","v":"2.5 - Redes de monitoramento e SI"},{"$f":"IFERROR(INDEX(IdentAcoes[Prioridade do PDC],MATCH(B29,IdentAcoes[ID Ação],0)),\"\")","v":"PDC 1 e 2"},{"$f":"IFERROR(INDEX(IdentAcoes[Segmento do executor],MATCH($B29,IdentAcoes[ID Ação],0)),\"\")","v":"Sociedade Civil"},{"$f":"IFERROR(INDEX(IdentAcoes[Área de abrangência],MATCH($B29,IdentAcoes[ID Ação],0)),\"\")","v":"Bacia"},{"$f":"IFERROR(INDEX(IdentAcoes[Detalhamento da área de abrangência],MATCH($B29,IdentAcoes[ID Ação],0)),\"\")","v":"Bacias PCJ"}]
["PCJ6.3.1.3/2025FEHIDRO - Cobrança estadual","PCJ6.3.1.3/2025",{"$f":"INDEX(Financeiro[Descrição da ação],MATCH(B30,Financeiro[ID Ação], 0))","v":"Fomentar a adequação das redes de monitoramento"},{"$f":"IF(INDEX('Acompanhamento das metas 24-27'!$C$2:$C$50,MATCH(B30,'Acompanhamento das metas 24-27'!$A$2:$A$50,0))<>0,INDEX('Acompanhamento das metas 24-27'!$C$2:$C$50,MATCH(B30,'Acompanhamento das metas 24-27'!$A$2:$A$50,0)),\"\")","v":"Contratação de 01 plano integrado de monitoramento"},{"$f":"IF(VLOOKUP(A30,Financeiro[[id_ação_Fonte_oculta]:[R$  Executado (2027)]],4,FALSE)=0,\"\",VLOOKUP(A30,Financeiro[[id_ação_Fonte_oculta]:[R$  Executado (2027)]],4,FALSE))","v":"FEHIDRO - Cobrança estadual"},{"$f":"IF(VLOOKUP(A30,Financeiro[[id_ação_Fonte_oculta]:[R$  Executado (2027)]],4,FALSE)=0,\"\",VLOOKUP(A30,Financeiro[[id_ação_Fonte_oculta]:[R$  Executado (2027)]],5,FALSE))","v":0},{"$f":"IF(VLOOKUP(A30,Financeiro[[id_ação_Fonte_oculta]:[R$  Executado (2027)]],4,FALSE)=0,\"\",VLOOKUP(A30,Financeiro[[id_ação_Fonte_oculta]:[R$  Executado (2027)]],8,FALSE))","v":35714.28},{"$f":"IF(VLOOKUP(A30,Financeiro[[id_ação_Fonte_oculta]:[R$  Executado (2027)]],4,FALSE)=0,\"\",VLOOKUP(A30,Financeiro[[id_ação_Fonte_oculta]:[R$  Executado (2027)]],11,FALSE))","v":0},{"$f":"IF(VLOOKUP(A30,Financeiro[[id_ação_Fonte_oculta]:[R$  Executado (2027)]],4,FALSE)=0,\"\",VLOOKUP(A30,Financeiro[[id_ação_Fonte_oculta]:[R$  Executado (2027)]],14,FALSE))","v":0},35714.28,{"$f":"IFERROR(INDEX(IdentAcoes[SubPDC],MATCH(B30,IdentAcoes[ID Ação],0)),\"\")","v":"2.5 - Redes de monitoramento e SI"},{"$f":"IFERROR(INDEX(IdentAcoes[Prioridade do PDC],MATCH(B30,IdentAcoes[ID Ação],0)),\"\")","v":"PDC 1 e 2"},{"$f":"IFERROR(INDEX(IdentAcoes[Segmento do executor],MATCH($B30,IdentAcoes[ID Ação],0)),\"\")","v":"Sociedade Civil"},{"$f":"IFERROR(INDEX(IdentAcoes[Área de abrangência],MATCH($B30,IdentAcoes[ID Ação],0)),\"\")","v":"Bacia"},{"$f":"IFERROR(INDEX(IdentAcoes[Detalhamento da área de abrangência],MATCH($B30,IdentAcoes[ID Ação],0)),\"\")","v":"Bacia Hidrográfica do rio Tietê"}]
["PCJ6.3.1.6/2026FEHIDRO - Cobrança estadual","PCJ6.3.1.6/2026",{"$f":"INDEX(Financeiro[Descrição da ação],MATCH(B31,Financeiro[ID Ação], 0))","v":"Integrar dados de monitoramento quali-quantitativos"},{"$f":"IF(INDEX('Acompanhamento das metas 24-27'!$C$2:$C$50,MATCH(B31,'Acompanhamento das metas 24-27'!$A$2:$A$50,0))<>0,INDEX('Acompanhamento das metas 24-27'!$C$2:$C$50,MATCH(B31,'Acompanhamento das metas 24-27'!$A$2:$A$50,0)),\"\")","v":"Contratação de plano integrado de monitoramento"},{"$f":"IF(VLOOKUP(A31,Financeiro[[id_ação_Fonte_oculta]:[R$  Executado (2027)]],4,FALSE)=0,\"\",VLOOKUP(A31,Financeiro[[id_ação_Fonte_oculta]:[R$  Executado (2027)]],4,FALSE))","v":"FEHIDRO - Cobrança estadual"},{"$f":"IF(VLOOKUP(A31,Financeiro[[id_ação_Fonte_oculta]:[R$  Executado (2027)]],4,FALSE)=0,\"\",VLOOKUP(A31,Financeiro[[id_ação_Fonte_oculta]:[R$  Executado (2027)]],5,FALSE))","v":0},{"$f":"IF(VLOOKUP(A31,Financeiro[[id_ação_Fonte_oculta]:[R$  Executado (2027)]],4,FALSE)=0,\"\",VLOOKUP(A31,Financeiro[[id_ação_Fonte_oculta]:[R$  Executado (2027)]],8,FALSE))","v":0},{"$f":"IF(VLOOKUP(A31,Financeiro[[id_ação_Fonte_oculta]:[R$  Executado (2027)]],4,FALSE)=0,\"\",VLOOKUP(A31,Financeiro[[id_ação_Fonte_oculta]:[R$  Executado (2027)]],11,FALSE))","v":35714.28},{"$f":"IF(VLOOKUP(A31,Financeiro[[id_ação_Fonte_oculta]:[R$  Executado (2027)]],4,FALSE)=0,\"\",VLOOKUP(A31,Financeiro[[id_ação_Fonte_oculta]:[R$  Executado (2027)]],14,FALSE))","v":0},35714.28,{"$f":"IFERROR(INDEX(IdentAcoes[SubPDC],MATCH(B31,IdentAcoes[ID Ação],0)),\"\")","v":"2.5 - Redes de monitoramento e SI"},{"$f":"IFERROR(INDEX(IdentAcoes[Prioridade do PDC],MATCH(B31,IdentAcoes[ID Ação],0)),\"\")","v":"PDC 1 e 2"},{"$f":"IFERROR(INDEX(IdentAcoes[Segmento do executor],MATCH($B31,IdentAcoes[ID Ação],0)),\"\")","v":"Sociedade Civil"},{"$f":"IFERROR(INDEX(IdentAcoes[Área de abrangência],MATCH($B31,IdentAcoes[ID Ação],0)),\"\")","v":"Bacia"},{"$f":"IFERROR(INDEX(IdentAcoes[Detalhamento da área de abrangência],MATCH($B31,IdentAcoes[ID Ação],0)),\"\")","v":"Bacia Hidrográfica do rio Tietê"}]
["PCJ6.3.2.2/2025FEHIDRO - Cobrança estadual","PCJ6.3.2.2/2025",{"$f":"INDEX(Financeiro[Descrição da ação],MATCH(B32,Financeiro[ID Ação], 0))","v":"Apoio à gestão administrativa da Fundação da Agência da Bacia Hidrográfica dos Rios Sorocaba e Médio Tietê"},{"$f":"IF(INDEX('Acompanhamento das metas 24-27'!$C$2:$C$50,MATCH(B32,'Acompanhamento das metas 24-27'!$A$2:$A$50,0))<>0,INDEX('Acompanhamento das metas 24-27'!$C$2:$C$50,MATCH(B32,'Acompanhamento das metas 24-27'!$A$2:$A$50,0)),\"\")","v":"Apoio prestado"},{"$f":"IF(VLOOKUP(A32,Financeiro[[id_ação_Fonte_oculta]:[R$  Executado (2027)]],4,FALSE)=0,\"\",VLOOKUP(A32,Financeiro[[id_ação_Fonte_oculta]:[R$  Executado (2027)]],4,FALSE))","v":"FEHIDRO - Cobrança estadual"},{"$f":"IF(VLOOKUP(A32,Financeiro[[id_ação_Fonte_oculta]:[R$  Executado (2027)]],4,FALSE)=0,\"\",VLOOKUP(A32,Financeiro[[id_ação_Fonte_oculta]:[R$  Executado (2027)]],5,FALSE))","v":0},{"$f":"IF(VLOOKUP(A32,Financeiro[[id_ação_Fonte_oculta]:[R$  Executado (2027)]],4,FALSE)=0,\"\",VLOOKUP(A32,Financeiro[[id_ação_Fonte_oculta]:[R$  Executado (2027)]],8,FALSE))","v":40000},{"$f":"IF(VLOOKUP(A32,Financeiro[[id_ação_Fonte_oculta]:[R$  Executado (2027)]],4,FALSE)=0,\"\",VLOOKUP(A32,Financeiro[[id_ação_Fonte_oculta]:[R$  Executado (2027)]],11,FALSE))","v":0},{"$f":"IF(VLOOKUP(A32,Financeiro[[id_ação_Fonte_oculta]:[R$  Executado (2027)]],4,FALSE)=0,\"\",VLOOKUP(A32,Financeiro[[id_ação_Fonte_oculta]:[R$  Executado (2027)]],14,FALSE))","v":0},40000,{"$f":"IFERROR(INDEX(IdentAcoes[SubPDC],MATCH(B32,IdentAcoes[ID Ação],0)),\"\")","v":"2.7 - CORHI"},{"$f":"IFERROR(INDEX(IdentAcoes[Prioridade do PDC],MATCH(B32,IdentAcoes[ID Ação],0)),\"\")","v":"PDC 1 e 2"},{"$f":"IFERROR(INDEX(IdentAcoes[Segmento do executor],MATCH($B32,IdentAcoes[ID Ação],0)),\"\")","v":"Sociedade Civil"},{"$f":"IFERROR(INDEX(IdentAcoes[Área de abrangência],MATCH($B32,IdentAcoes[ID Ação],0)),\"\")","v":"Bacia"},{"$f":"IFERROR(INDEX(IdentAcoes[Detalhamento da área de abrangência],MATCH($B32,IdentAcoes[ID Ação],0)),\"\")","v":"Bacia Hidrográfica do rio Tietê"}]
["PCJ6.3.1.1/2025FEHIDRO - Cobrança estadual","PCJ6.3.1.1/2025",{"$f":"INDEX(Financeiro[Descrição da ação],MATCH(B33,Financeiro[ID Ação], 0))","v":"Discutir a possibilidade de implantação de agências de bacia"},{"$f":"IF(INDEX('Acompanhamento das metas 24-27'!$C$2:$C$50,MATCH(B33,'Acompanhamento das metas 24-27'!$A$2:$A$50,0))<>0,INDEX('Acompanhamento das metas 24-27'!$C$2:$C$50,MATCH(B33,'Acompanhamento das metas 24-27'!$A$2:$A$50,0)),\"\")","v":"Realização de um estudo sobre a implantação de agências de bacia"},{"$f":"IF(VLOOKUP(A33,Financeiro[[id_ação_Fonte_oculta]:[R$  Executado (2027)]],4,FALSE)=0,\"\",VLOOKUP(A33,Financeiro[[id_ação_Fonte_oculta]:[R$  Executado (2027)]],4,FALSE))","v":"FEHIDRO - Cobrança estadual"},{"$f":"IF(VLOOKUP(A33,Financeiro[[id_ação_Fonte_oculta]:[R$  Executado (2027)]],4,FALSE)=0,\"\",VLOOKUP(A33,Financeiro[[id_ação_Fonte_oculta]:[R$  Executado (2027)]],5,FALSE))","v":0},{"$f":"IF(VLOOKUP(A33,Financeiro[[id_ação_Fonte_oculta]:[R$  Executado (2027)]],4,FALSE)=0,\"\",VLOOKUP(A33,Financeiro[[id_ação_Fonte_oculta]:[R$  Executado (2027)]],8,FALSE))","v":300000},{"$f":"IF(VLOOKUP(A33,Financeiro[[id_ação_Fonte_oculta]:[R$  Executado (2027)]],4,FALSE)=0,\"\",VLOOKUP(A33,Financeiro[[id_ação_Fonte_oculta]:[R$  Executado (2027)]],11,FALSE))","v":0},{"$f":"IF(VLOOKUP(A33,Financeiro[[id_ação_Fonte_oculta]:[R$  Executado (2027)]],4,FALSE)=0,\"\",VLOOKUP(A33,Financeiro[[id_ação_Fonte_oculta]:[R$  Executado (2027)]],14,FALSE))","v":0},300000,{"$f":"IFERROR(INDEX(IdentAcoes[SubPDC],MATCH(B33,IdentAcoes[ID Ação],0)),\"\")","v":"2.7 - CORHI"},{"$f":"IFERROR(INDEX(IdentAcoes[Prioridade do PDC],MATCH(B33,IdentAcoes[ID Ação],0)),\"\")","v":"PDC 1 e 2"},{"$f":"IFERROR(INDEX(IdentAcoes[Segmento do executor],MATCH($B33,IdentAcoes[ID Ação],0)),\"\")","v":"Sociedade Civil"},{"$f":"IFERROR(INDEX(IdentAcoes[Área de abrangência],MATCH($B33,IdentAcoes[ID Ação],0)),\"\")","v":"Bacia"},{"$f":"IFERROR(INDEX(IdentAcoes[Detalhamento da área de abrangência],MATCH($B33,IdentAcoes[ID Ação],0)),\"\")","v":"Bacia Hidrográfica do rio Tietê"}]
["PCJ3.3.1.1/2024FEHIDRO - Cobrança estadual","PCJ3.3.1.1/2024",{"$f":"INDEX(Financeiro[Descrição da ação],MATCH(B34,Financeiro[ID Ação], 0))","v":"Substituição de sistemas rudimentares de tratamento de esgoto (fossa negra) por sistemas mais eficientes"},{"$f":"IF(INDEX('Acompanhamento das metas 24-27'!$C$2:$C$50,MATCH(B34,'Acompanhamento das metas 24-27'!$A$2:$A$50,0))<>0,INDEX('Acompanhamento das metas 24-27'!$C$2:$C$50,MATCH(B34,'Acompanhamento das metas 24-27'!$A$2:$A$50,0)),\"\")","v":"Substituição de 30 sistemas "},{"$f":"IF(VLOOKUP(A34,Financeiro[[id_ação_Fonte_oculta]:[R$  Executado (2027)]],4,FALSE)=0,\"\",VLOOKUP(A34,Financeiro[[id_ação_Fonte_oculta]:[R$  Executado (2027)]],4,FALSE))","v":"FEHIDRO - Cobrança estadual"},{"$f":"IF(VLOOKUP(A34,Financeiro[[id_ação_Fonte_oculta]:[R$  Executado (2027)]],4,FALSE)=0,\"\",VLOOKUP(A34,Financeiro[[id_ação_Fonte_oculta]:[R$  Executado (2027)]],5,FALSE))","v":2300000},{"$f":"IF(VLOOKUP(A34,Financeiro[[id_ação_Fonte_oculta]:[R$  Executado (2027)]],4,FALSE)=0,\"\",VLOOKUP(A34,Financeiro[[id_ação_Fonte_oculta]:[R$  Executado (2027)]],8,FALSE))","v":2000000},{"$f":"IF(VLOOKUP(A34,Financeiro[[id_ação_Fonte_oculta]:[R$  Executado (2027)]],4,FALSE)=0,\"\",VLOOKUP(A34,Financeiro[[id_ação_Fonte_oculta]:[R$  Executado (2027)]],11,FALSE))","v":1000000},{"$f":"IF(VLOOKUP(A34,Financeiro[[id_ação_Fonte_oculta]:[R$  Executado (2027)]],4,FALSE)=0,\"\",VLOOKUP(A34,Financeiro[[id_ação_Fonte_oculta]:[R$  Executado (2027)]],14,FALSE))","v":1250000},6550000,{"$f":"IFERROR(INDEX(IdentAcoes[SubPDC],MATCH(B34,IdentAcoes[ID Ação],0)),\"\")","v":"3.1 - Efluentes"},{"$f":"IFERROR(INDEX(IdentAcoes[Prioridade do PDC],MATCH(B34,IdentAcoes[ID Ação],0)),\"\")","v":"Prioritário"},{"$f":"IFERROR(INDEX(IdentAcoes[Segmento do executor],MATCH($B34,IdentAcoes[ID Ação],0)),\"\")","v":"Município"},{"$f":"IFERROR(INDEX(IdentAcoes[Área de abrangência],MATCH($B34,IdentAcoes[ID Ação],0)),\"\")","v":"Município"},{"$f":"IFERROR(INDEX(IdentAcoes[Detalhamento da área de abrangência],MATCH($B34,IdentAcoes[ID Ação],0)),\"\")","v":"Município"}]
["PCJ1.1.1.4/2024FEHIDRO - Cobrança estadual","PCJ1.1.1.4/2024",{"$f":"INDEX(Financeiro[Descrição da ação],MATCH(B35,Financeiro[ID Ação], 0))","v":"Elaboração de projetos de ampliação e melhoria dos sistemas de transporte de esgotos"},{"$f":"IF(INDEX('Acompanhamento das metas 24-27'!$C$2:$C$50,MATCH(B35,'Acompanhamento das metas 24-27'!$A$2:$A$50,0))<>0,INDEX('Acompanhamento das metas 24-27'!$C$2:$C$50,MATCH(B35,'Acompanhamento das metas 24-27'!$A$2:$A$50,0)),\"\")","v":"Elaboração de ao menos 01 projeto"},{"$f":"IF(VLOOKUP(A35,Financeiro[[id_ação_Fonte_oculta]:[R$  Executado (2027)]],4,FALSE)=0,\"\",VLOOKUP(A35,Financeiro[[id_ação_Fonte_oculta]:[R$  Executado (2027)]],4,FALSE))","v":"FEHIDRO - Cobrança estadual"},{"$f":"IF(VLOOKUP(A35,Financeiro[[id_ação_Fonte_oculta]:[R$  Executado (2027)]],4,FALSE)=0,\"\",VLOOKUP(A35,Financeiro[[id_ação_Fonte_oculta]:[R$  Executado (2027)]],5,FALSE))","v":2000000},{"$f":"IF(VLOOKUP(A35,Financeiro[[id_ação_Fonte_oculta]:[R$  Executado (2027)]],4,FALSE)=0,\"\",VLOOKUP(A35,Financeiro[[id_ação_Fonte_oculta]:[R$  Executado (2027)]],8,FALSE))","v":1000000},{"$f":"IF(VLOOKUP(A35,Financeiro[[id_ação_Fonte_oculta]:[R$  Executado (2027)]],4,FALSE)=0,\"\",VLOOKUP(A35,Financeiro[[id_ação_Fonte_oculta]:[R$  Executado (2027)]],11,FALSE))","v":650000},{"$f":"IF(VLOOKUP(A35,Financeiro[[id_ação_Fonte_oculta]:[R$  Executado (2027)]],4,FALSE)=0,\"\",VLOOKUP(A35,Financeiro[[id_ação_Fonte_oculta]:[R$  Executado (2027)]],14,FALSE))","v":750000},4400000,{"$f":"IFERROR(INDEX(IdentAcoes[SubPDC],MATCH(B35,IdentAcoes[ID Ação],0)),\"\")","v":"3.1 - Efluentes"},{"$f":"IFERROR(INDEX(IdentAcoes[Prioridade do PDC],MATCH(B35,IdentAcoes[ID Ação],0)),\"\")","v":"Prioritário"},{"$f":"IFERROR(INDEX(IdentAcoes[Segmento do executor],MATCH($B35,IdentAcoes[ID Ação],0)),\"\")","v":"Município"},{"$f":"IFERROR(INDEX(IdentAcoes[Área de abrangência],MATCH($B35,IdentAcoes[ID Ação],0)),\"\")","v":"Município"},{"$f":"IFERROR(INDEX(IdentAcoes[Detalhamento da área de abrangência],MATCH($B35,IdentAcoes[ID Ação],0)),\"\")","v":"Municípios observando asprioridades para remoção de nitrogênio e fósforo, no Plano de Bacias"}]
["PCJ1.1.2.3/2024FEHIDRO - Cobrança estadual","PCJ1.1.2.3/2024",{"$f":"INDEX(Financeiro[Descrição da ação],MATCH(B36,Financeiro[ID Ação], 0))","v":"Elaboração de projetos para a implantação de novas ETEs visando tratamento secundário"},{"$f":"IF(INDEX('Acompanhamento das metas 24-27'!$C$2:$C$50,MATCH(B36,'Acompanhamento das metas 24-27'!$A$2:$A$50,0))<>0,INDEX('Acompanhamento das metas 24-27'!$C$2:$C$50,MATCH(B36,'Acompanhamento das metas 24-27'!$A$2:$A$50,0)),\"\")","v":"Elaboração de ao menos 01 projeto"},{"$f":"IF(VLOOKUP(A36,Financeiro[[id_ação_Fonte_oculta]:[R$  Executado (2027)]],4,FALSE)=0,\"\",VLOOKUP(A36,Financeiro[[id_ação_Fonte_oculta]:[R$  Executado (2027)]],4,FALSE))","v":"FEHIDRO - Cobrança estadual"},{"$f":"IF(VLOOKUP(A36,Financeiro[[id_ação_Fonte_oculta]:[R$  Executado (2027)]],4,FALSE)=0,\"\",VLOOKUP(A36,Financeiro[[id_ação_Fonte_oculta]:[R$  Executado (2027)]],5,FALSE))","v":1300000},{"$f":"IF(VLOOKUP(A36,Financeiro[[id_ação_Fonte_oculta]:[R$  Executado (2027)]],4,FALSE)=0,\"\",VLOOKUP(A36,Financeiro[[id_ação_Fonte_oculta]:[R$  Executado (2027)]],8,FALSE))","v":1000000},{"$f":"IF(VLOOKUP(A36,Financeiro[[id_ação_Fonte_oculta]:[R$  Executado (2027)]],4,FALSE)=0,\"\",VLOOKUP(A36,Financeiro[[id_ação_Fonte_oculta]:[R$  Executado (2027)]],11,FALSE))","v":750000},{"$f":"IF(VLOOKUP(A36,Financeiro[[id_ação_Fonte_oculta]:[R$  Executado (2027)]],4,FALSE)=0,\"\",VLOOKUP(A36,Financeiro[[id_ação_Fonte_oculta]:[R$  Executado (2027)]],14,FALSE))","v":750000},3800000,{"$f":"IFERROR(INDEX(IdentAcoes[SubPDC],MATCH(B36,IdentAcoes[ID Ação],0)),\"\")","v":"3.1 - Efluentes"},{"$f":"IFERROR(INDEX(IdentAcoes[Prioridade do PDC],MATCH(B36,IdentAcoes[ID Ação],0)),\"\")","v":"Prioritário"},{"$f":"IFERROR(INDEX(IdentAcoes[Segmento do executor],MATCH($B36,IdentAcoes[ID Ação],0)),\"\")","v":"Município"},{"$f":"IFERROR(INDEX(IdentAcoes[Área de abrangência],MATCH($B36,IdentAcoes[ID Ação],0)),\"\")","v":"Município"},{"$f":"IFERROR(INDEX(IdentAcoes[Detalhamento da área de abrangência],MATCH($B36,IdentAcoes[ID Ação],0)),\"\")","v":"Municípios observando as prioridades para remoção de nitrogênio e fósforo, no Plano de Bacias"}]
["PCJ1.2.1.2/2024FEHIDRO - Cobrança estadual","PCJ1.2.1.2/2024",{"$f":"INDEX(Financeiro[Descrição da ação],MATCH(B37,Financeiro[ID Ação], 0))","v":"Elaboração de projetos de melhorias da eficiência das ETEs na remoção de nutrientes"},{"$f":"IF(INDEX('Acompanhamento das metas 24-27'!$C$2:$C$50,MATCH(B37,'Acompanhamento das metas 24-27'!$A$2:$A$50,0))<>0,INDEX('Acompanhamento das metas 24-27'!$C$2:$C$50,MATCH(B37,'Acompanhamento das metas 24-27'!$A$2:$A$50,0)),\"\")","v":"Elaboração de ao menos 01 projeto"},{"$f":"IF(VLOOKUP(A37,Financeiro[[id_ação_Fonte_oculta]:[R$  Executado (2027)]],4,FALSE)=0,\"\",VLOOKUP(A37,Financeiro[[id_ação_Fonte_oculta]:[R$  Executado (2027)]],4,FALSE))","v":"FEHIDRO - Cobrança estadual"},{"$f":"IF(VLOOKUP(A37,Financeiro[[id_ação_Fonte_oculta]:[R$  Executado (2027)]],4,FALSE)=0,\"\",VLOOKUP(A37,Financeiro[[id_ação_Fonte_oculta]:[R$  Executado (2027)]],5,FALSE))","v":1300000},{"$f":"IF(VLOOKUP(A37,Financeiro[[id_ação_Fonte_oculta]:[R$  Executado (2027)]],4,FALSE)=0,\"\",VLOOKUP(A37,Financeiro[[id_ação_Fonte_oculta]:[R$  Executado (2027)]],8,FALSE))","v":1000000},{"$f":"IF(VLOOKUP(A37,Financeiro[[id_ação_Fonte_oculta]:[R$  Executado (2027)]],4,FALSE)=0,\"\",VLOOKUP(A37,Financeiro[[id_ação_Fonte_oculta]:[R$  Executado (2027)]],11,FALSE))","v":750000},{"$f":"IF(VLOOKUP(A37,Financeiro[[id_ação_Fonte_oculta]:[R$  Executado (2027)]],4,FALSE)=0,\"\",VLOOKUP(A37,Financeiro[[id_ação_Fonte_oculta]:[R$  Executado (2027)]],14,FALSE))","v":750000},3800000,{"$f":"IFERROR(INDEX(IdentAcoes[SubPDC],MATCH(B37,IdentAcoes[ID Ação],0)),\"\")","v":"3.1 - Efluentes"},{"$f":"IFERROR(INDEX(IdentAcoes[Prioridade do PDC],MATCH(B37,IdentAcoes[ID Ação],0)),\"\")","v":"Prioritário"},{"$f":"IFERROR(INDEX(IdentAcoes[Segmento do executor],MATCH($B37,IdentAcoes[ID Ação],0)),\"\")","v":"Município"},{"$f":"IFERROR(INDEX(IdentAcoes[Área de abrangência],MATCH($B37,IdentAcoes[ID Ação],0)),\"\")","v":"Município"},{"$f":"IFERROR(INDEX(IdentAcoes[Detalhamento da área de abrangência],MATCH($B37,IdentAcoes[ID Ação],0)),\"\")","v":"Municípios observando as prioridades para remoção de nitrogênio e fósforo, no Plano de Bacias"}]
["PCJ1.2.2.2/2027FEHIDRO - Cobrança estadual","PCJ1.2.2.2/2027",{"$f":"INDEX(Financeiro[Descrição da ação],MATCH(B38,Financeiro[ID Ação], 0))","v":"Elaboração de projetos de implantação de tecnologias de desinfecção de efluentes domésticos"},{"$f":"IF(INDEX('Acompanhamento das metas 24-27'!$C$2:$C$50,MATCH(B38,'Acompanhamento das metas 24-27'!$A$2:$A$50,0))<>0,INDEX('Acompanhamento das metas 24-27'!$C$2:$C$50,MATCH(B38,'Acompanhamento das metas 24-27'!$A$2:$A$50,0)),\"\")","v":"Elaboração de ao menos 01 projeto por ano"},{"$f":"IF(VLOOKUP(A38,Financeiro[[id_ação_Fonte_oculta]:[R$  Executado (2027)]],4,FALSE)=0,\"\",VLOOKUP(A38,Financeiro[[id_ação_Fonte_oculta]:[R$  Executado (2027)]],4,FALSE))","v":"FEHIDRO - Cobrança estadual"},{"$f":"IF(VLOOKUP(A38,Financeiro[[id_ação_Fonte_oculta]:[R$  Executado (2027)]],4,FALSE)=0,\"\",VLOOKUP(A38,Financeiro[[id_ação_Fonte_oculta]:[R$  Executado (2027)]],5,FALSE))","v":0},{"$f":"IF(VLOOKUP(A38,Financeiro[[id_ação_Fonte_oculta]:[R$  Executado (2027)]],4,FALSE)=0,\"\",VLOOKUP(A38,Financeiro[[id_ação_Fonte_oculta]:[R$  Executado (2027)]],8,FALSE))","v":0},{"$f":"IF(VLOOKUP(A38,Financeiro[[id_ação_Fonte_oculta]:[R$  Executado (2027)]],4,FALSE)=0,\"\",VLOOKUP(A38,Financeiro[[id_ação_Fonte_oculta]:[R$  Executado (2027)]],11,FALSE))","v":0},{"$f":"IF(VLOOKUP(A38,Financeiro[[id_ação_Fonte_oculta]:[R$  Executado (2027)]],4,FALSE)=0,\"\",VLOOKUP(A38,Financeiro[[id_ação_Fonte_oculta]:[R$  Executado (2027)]],14,FALSE))","v":500000},500000,{"$f":"IFERROR(INDEX(IdentAcoes[SubPDC],MATCH(B38,IdentAcoes[ID Ação],0)),\"\")","v":"3.1 - Efluentes"},{"$f":"IFERROR(INDEX(IdentAcoes[Prioridade do PDC],MATCH(B38,IdentAcoes[ID Ação],0)),\"\")","v":"Prioritário"},{"$f":"IFERROR(INDEX(IdentAcoes[Segmento do executor],MATCH($B38,IdentAcoes[ID Ação],0)),\"\")","v":"Município"},{"$f":"IFERROR(INDEX(IdentAcoes[Área de abrangência],MATCH($B38,IdentAcoes[ID Ação],0)),\"\")","v":"Município"},{"$f":"IFERROR(INDEX(IdentAcoes[Detalhamento da área de abrangência],MATCH($B38,IdentAcoes[ID Ação],0)),\"\")","v":"Municípios observando as prioridades no Plano de Bacias"}]
["PCJ3.1.2.3/2024FEHIDRO - Cobrança estadual","PCJ3.1.2.3/2024",{"$f":"INDEX(Financeiro[Descrição da ação],MATCH(B39,Financeiro[ID Ação], 0))","v":"Incentivo à proteção das áreas sujeitas à restrição de uso"},{"$f":"IF(INDEX('Acompanhamento das metas 24-27'!$C$2:$C$50,MATCH(B39,'Acompanhamento das metas 24-27'!$A$2:$A$50,0))<>0,INDEX('Acompanhamento das metas 24-27'!$C$2:$C$50,MATCH(B39,'Acompanhamento das metas 24-27'!$A$2:$A$50,0)),\"\")","v":"Implementação da RAP-PCJ; \nDisponibilização e atualização de dados e informações sobre áreas protegidas nas Bacias PCJ;\nElaboração de diagnóstico com a mensuração dos benefícios hídricos das áreas protegidas."},{"$f":"IF(VLOOKUP(A39,Financeiro[[id_ação_Fonte_oculta]:[R$  Executado (2027)]],4,FALSE)=0,\"\",VLOOKUP(A39,Financeiro[[id_ação_Fonte_oculta]:[R$  Executado (2027)]],4,FALSE))","v":"FEHIDRO - Cobrança estadual"},{"$f":"IF(VLOOKUP(A39,Financeiro[[id_ação_Fonte_oculta]:[R$  Executado (2027)]],4,FALSE)=0,\"\",VLOOKUP(A39,Financeiro[[id_ação_Fonte_oculta]:[R$  Executado (2027)]],5,FALSE))","v":0},{"$f":"IF(VLOOKUP(A39,Financeiro[[id_ação_Fonte_oculta]:[R$  Executado (2027)]],4,FALSE)=0,\"\",VLOOKUP(A39,Financeiro[[id_ação_Fonte_oculta]:[R$  Executado (2027)]],8,FALSE))","v":0},{"$f":"IF(VLOOKUP(A39,Financeiro[[id_ação_Fonte_oculta]:[R$  Executado (2027)]],4,FALSE)=0,\"\",VLOOKUP(A39,Financeiro[[id_ação_Fonte_oculta]:[R$  Executado (2027)]],11,FALSE))","v":0},{"$f":"IF(VLOOKUP(A39,Financeiro[[id_ação_Fonte_oculta]:[R$  Executado (2027)]],4,FALSE)=0,\"\",VLOOKUP(A39,Financeiro[[id_ação_Fonte_oculta]:[R$  Executado (2027)]],14,FALSE))","v":0},0,{"$f":"IFERROR(INDEX(IdentAcoes[SubPDC],MATCH(B39,IdentAcoes[ID Ação],0)),\"\")","v":"4.2 - Soluções baseadas Natureza"},{"$f":"IFERROR(INDEX(IdentAcoes[Prioridade do PDC],MATCH(B39,IdentAcoes[ID Ação],0)),\"\")","v":"Não prioritário"},{"$f":"IFERROR(INDEX(IdentAcoes[Segmento do executor],MATCH($B39,IdentAcoes[ID Ação],0)),\"\")","v":"Sociedade Civil"},{"$f":"IFERROR(INDEX(IdentAcoes[Área de abrangência],MATCH($B39,IdentAcoes[ID Ação],0)),\"\")","v":"Sub-bacia"},{"$f":"IFERROR(INDEX(IdentAcoes[Detalhamento da área de abrangência],MATCH($B39,IdentAcoes[ID Ação],0)),\"\")","v":"ACs prioritárias conforme mapa síntese  Mapa  Conservação, recuperação de nascentes, matas ciliares e áreas de recarga"}]
["PCJ2.3.2.2/2024FEHIDRO - Cobrança estadual","PCJ2.3.2.2/2024",{"$f":"INDEX(Financeiro[Descrição da ação],MATCH(B40,Financeiro[ID Ação], 0))","v":"Controle de perdas em sistemas de abastecimento de água"},{"$f":"IF(INDEX('Acompanhamento das metas 24-27'!$C$2:$C$50,MATCH(B40,'Acompanhamento das metas 24-27'!$A$2:$A$50,0))<>0,INDEX('Acompanhamento das metas 24-27'!$C$2:$C$50,MATCH(B40,'Acompanhamento das metas 24-27'!$A$2:$A$50,0)),\"\")","v":"Alcance das metas intermediárias dos cenários de referência para planejamento, conforme descrito no  Plano de Bacias"},{"$f":"IF(VLOOKUP(A40,Financeiro[[id_ação_Fonte_oculta]:[R$  Executado (2027)]],4,FALSE)=0,\"\",VLOOKUP(A40,Financeiro[[id_ação_Fonte_oculta]:[R$  Executado (2027)]],4,FALSE))","v":"FEHIDRO - Cobrança estadual"},{"$f":"IF(VLOOKUP(A40,Financeiro[[id_ação_Fonte_oculta]:[R$  Executado (2027)]],4,FALSE)=0,\"\",VLOOKUP(A40,Financeiro[[id_ação_Fonte_oculta]:[R$  Executado (2027)]],5,FALSE))","v":5120748.0999999996},{"$f":"IF(VLOOKUP(A40,Financeiro[[id_ação_Fonte_oculta]:[R$  Executado (2027)]],4,FALSE)=0,\"\",VLOOKUP(A40,Financeiro[[id_ação_Fonte_oculta]:[R$  Executado (2027)]],8,FALSE))","v":4551857.16},{"$f":"IF(VLOOKUP(A40,Financeiro[[id_ação_Fonte_oculta]:[R$  Executado (2027)]],4,FALSE)=0,\"\",VLOOKUP(A40,Financeiro[[id_ação_Fonte_oculta]:[R$  Executado (2027)]],11,FALSE))","v":1500000},{"$f":"IF(VLOOKUP(A40,Financeiro[[id_ação_Fonte_oculta]:[R$  Executado (2027)]],4,FALSE)=0,\"\",VLOOKUP(A40,Financeiro[[id_ação_Fonte_oculta]:[R$  Executado (2027)]],14,FALSE))","v":1500000},12672605.26,{"$f":"IFERROR(INDEX(IdentAcoes[SubPDC],MATCH(B40,IdentAcoes[ID Ação],0)),\"\")","v":"5.1 - Perdas"},{"$f":"IFERROR(INDEX(IdentAcoes[Prioridade do PDC],MATCH(B40,IdentAcoes[ID Ação],0)),\"\")","v":"Prioritário"},{"$f":"IFERROR(INDEX(IdentAcoes[Segmento do executor],MATCH($B40,IdentAcoes[ID Ação],0)),\"\")","v":"Município"},{"$f":"IFERROR(INDEX(IdentAcoes[Área de abrangência],MATCH($B40,IdentAcoes[ID Ação],0)),\"\")","v":"Município"},{"$f":"IFERROR(INDEX(IdentAcoes[Detalhamento da área de abrangência],MATCH($B40,IdentAcoes[ID Ação],0)),\"\")","v":"Para 2020, municípios prioritários indicados na Deliberação dos Comitês PCJ nº 324/2019. A partir de 2021, municípios observando as prioridades do Plano de Bacias"}]
["PCJ5.2.2.1/2024FEHIDRO - Cobrança estadual","PCJ5.2.2.1/2024",{"$f":"INDEX(Financeiro[Descrição da ação],MATCH(B41,Financeiro[ID Ação], 0))","v":"Elaboração de propostas para órgãos de financiamento em pesquisas"},{"$f":"IF(INDEX('Acompanhamento das metas 24-27'!$C$2:$C$50,MATCH(B41,'Acompanhamento das metas 24-27'!$A$2:$A$50,0))<>0,INDEX('Acompanhamento das metas 24-27'!$C$2:$C$50,MATCH(B41,'Acompanhamento das metas 24-27'!$A$2:$A$50,0)),\"\")","v":"Propostas de linhas de fomento encaminhadas para órgãos de financiamento de pesquisas."},{"$f":"IF(VLOOKUP(A41,Financeiro[[id_ação_Fonte_oculta]:[R$  Executado (2027)]],4,FALSE)=0,\"\",VLOOKUP(A41,Financeiro[[id_ação_Fonte_oculta]:[R$  Executado (2027)]],4,FALSE))","v":"FEHIDRO - Cobrança estadual"},{"$f":"IF(VLOOKUP(A41,Financeiro[[id_ação_Fonte_oculta]:[R$  Executado (2027)]],4,FALSE)=0,\"\",VLOOKUP(A41,Financeiro[[id_ação_Fonte_oculta]:[R$  Executado (2027)]],5,FALSE))","v":0},{"$f":"IF(VLOOKUP(A41,Financeiro[[id_ação_Fonte_oculta]:[R$  Executado (2027)]],4,FALSE)=0,\"\",VLOOKUP(A41,Financeiro[[id_ação_Fonte_oculta]:[R$  Executado (2027)]],8,FALSE))","v":0},{"$f":"IF(VLOOKUP(A41,Financeiro[[id_ação_Fonte_oculta]:[R$  Executado (2027)]],4,FALSE)=0,\"\",VLOOKUP(A41,Financeiro[[id_ação_Fonte_oculta]:[R$  Executado (2027)]],11,FALSE))","v":0},{"$f":"IF(VLOOKUP(A41,Financeiro[[id_ação_Fonte_oculta]:[R$  Executado (2027)]],4,FALSE)=0,\"\",VLOOKUP(A41,Financeiro[[id_ação_Fonte_oculta]:[R$  Executado (2027)]],14,FALSE))","v":0},0,{"$f":"IFERROR(INDEX(IdentAcoes[SubPDC],MATCH(B41,IdentAcoes[ID Ação],0)),\"\")","v":"8.1 - Capacitação"},{"$f":"IFERROR(INDEX(IdentAcoes[Prioridade do PDC],MATCH(B41,IdentAcoes[ID Ação],0)),\"\")","v":"Não prioritário"},{"$f":"IFERROR(INDEX(IdentAcoes[Segmento do executor],MATCH($B41,IdentAcoes[ID Ação],0)),\"\")","v":"Sociedade Civil"},{"$f":"IFERROR(INDEX(IdentAcoes[Área de abrangência],MATCH($B41,IdentAcoes[ID Ação],0)),\"\")","v":"Bacia"},{"$f":"IFERROR(INDEX(IdentAcoes[Detalhamento da área de abrangência],MATCH($B41,IdentAcoes[ID Ação],0)),\"\")","v":"Bacias PCJ"}]
["PCJ5.2.2.3/2024FEHIDRO - Cobrança estadual","PCJ5.2.2.3/2024",{"$f":"INDEX(Financeiro[Descrição da ação],MATCH(B42,Financeiro[ID Ação], 0))","v":"Apoio ao desenvolvimento e difusão de pesquisas e tecnologias que contribuam no enfrentamento dos desafios identificados no Plano das Bacias PCJ"},{"$f":"IF(INDEX('Acompanhamento das metas 24-27'!$C$2:$C$50,MATCH(B42,'Acompanhamento das metas 24-27'!$A$2:$A$50,0))<>0,INDEX('Acompanhamento das metas 24-27'!$C$2:$C$50,MATCH(B42,'Acompanhamento das metas 24-27'!$A$2:$A$50,0)),\"\")","v":"1 parcerias ou convênios firmados até 2027"},{"$f":"IF(VLOOKUP(A42,Financeiro[[id_ação_Fonte_oculta]:[R$  Executado (2027)]],4,FALSE)=0,\"\",VLOOKUP(A42,Financeiro[[id_ação_Fonte_oculta]:[R$  Executado (2027)]],4,FALSE))","v":"FEHIDRO - Cobrança estadual"},{"$f":"IF(VLOOKUP(A42,Financeiro[[id_ação_Fonte_oculta]:[R$  Executado (2027)]],4,FALSE)=0,\"\",VLOOKUP(A42,Financeiro[[id_ação_Fonte_oculta]:[R$  Executado (2027)]],5,FALSE))","v":0},{"$f":"IF(VLOOKUP(A42,Financeiro[[id_ação_Fonte_oculta]:[R$  Executado (2027)]],4,FALSE)=0,\"\",VLOOKUP(A42,Financeiro[[id_ação_Fonte_oculta]:[R$  Executado (2027)]],8,FALSE))","v":0},{"$f":"IF(VLOOKUP(A42,Financeiro[[id_ação_Fonte_oculta]:[R$  Executado (2027)]],4,FALSE)=0,\"\",VLOOKUP(A42,Financeiro[[id_ação_Fonte_oculta]:[R$  Executado (2027)]],11,FALSE))","v":0},{"$f":"IF(VLOOKUP(A42,Financeiro[[id_ação_Fonte_oculta]:[R$  Executado (2027)]],4,FALSE)=0,\"\",VLOOKUP(A42,Financeiro[[id_ação_Fonte_oculta]:[R$  Executado (2027)]],14,FALSE))","v":0},0,{"$f":"IFERROR(INDEX(IdentAcoes[SubPDC],MATCH(B42,IdentAcoes[ID Ação],0)),\"\")","v":"8.2 - Educação"},{"$f":"IFERROR(INDEX(IdentAcoes[Prioridade do PDC],MATCH(B42,IdentAcoes[ID Ação],0)),\"\")","v":"Não prioritário"},{"$f":"IFERROR(INDEX(IdentAcoes[Segmento do executor],MATCH($B42,IdentAcoes[ID Ação],0)),\"\")","v":"Sociedade Civil"},{"$f":"IFERROR(INDEX(IdentAcoes[Área de abrangência],MATCH($B42,IdentAcoes[ID Ação],0)),\"\")","v":"Bacia"},{"$f":"IFERROR(INDEX(IdentAcoes[Detalhamento da área de abrangência],MATCH($B42,IdentAcoes[ID Ação],0)),\"\")","v":"Bacias PCJ"}]
["PCJ6.2.5.2/2027FEHIDRO - Cobrança estadual","PCJ6.2.5.2/2027",{"$f":"INDEX(Financeiro[Descrição da ação],MATCH(B43,Financeiro[ID Ação], 0))","v":"Apoio à regularização de outorga na área rural"},{"$f":"IF(INDEX('Acompanhamento das metas 24-27'!$C$2:$C$50,MATCH(B43,'Acompanhamento das metas 24-27'!$A$2:$A$50,0))<>0,INDEX('Acompanhamento das metas 24-27'!$C$2:$C$50,MATCH(B43,'Acompanhamento das metas 24-27'!$A$2:$A$50,0)),\"\")","v":"Campanhas de divulgação realizadas e suporte técnico fornecido"},{"$f":"IF(VLOOKUP(A43,Financeiro[[id_ação_Fonte_oculta]:[R$  Executado (2027)]],4,FALSE)=0,\"\",VLOOKUP(A43,Financeiro[[id_ação_Fonte_oculta]:[R$  Executado (2027)]],4,FALSE))","v":"FEHIDRO - Cobrança estadual"},{"$f":"IF(VLOOKUP(A43,Financeiro[[id_ação_Fonte_oculta]:[R$  Executado (2027)]],4,FALSE)=0,\"\",VLOOKUP(A43,Financeiro[[id_ação_Fonte_oculta]:[R$  Executado (2027)]],5,FALSE))","v":0},{"$f":"IF(VLOOKUP(A43,Financeiro[[id_ação_Fonte_oculta]:[R$  Executado (2027)]],4,FALSE)=0,\"\",VLOOKUP(A43,Financeiro[[id_ação_Fonte_oculta]:[R$  Executado (2027)]],8,FALSE))","v":0},{"$f":"IF(VLOOKUP(A43,Financeiro[[id_ação_Fonte_oculta]:[R$  Executado (2027)]],4,FALSE)=0,\"\",VLOOKUP(A43,Financeiro[[id_ação_Fonte_oculta]:[R$  Executado (2027)]],11,FALSE))","v":0},{"$f":"IF(VLOOKUP(A43,Financeiro[[id_ação_Fonte_oculta]:[R$  Executado (2027)]],4,FALSE)=0,\"\",VLOOKUP(A43,Financeiro[[id_ação_Fonte_oculta]:[R$  Executado (2027)]],14,FALSE))","v":400000},400000,{"$f":"IFERROR(INDEX(IdentAcoes[SubPDC],MATCH(B43,IdentAcoes[ID Ação],0)),\"\")","v":"8.3 - Comunicação"},{"$f":"IFERROR(INDEX(IdentAcoes[Prioridade do PDC],MATCH(B43,IdentAcoes[ID Ação],0)),\"\")","v":"Não prioritário"},{"$f":"IFERROR(INDEX(IdentAcoes[Segmento do executor],MATCH($B43,IdentAcoes[ID Ação],0)),\"\")","v":"Sociedade Civil"},{"$f":"IFERROR(INDEX(IdentAcoes[Área de abrangência],MATCH($B43,IdentAcoes[ID Ação],0)),\"\")","v":"Bacia"},{"$f":"IFERROR(INDEX(IdentAcoes[Detalhamento da área de abrangência],MATCH($B43,IdentAcoes[ID Ação],0)),\"\")","v":"Bacias PCJ"}]
["PCJ1.1.1.1/2024Outras fontes","PCJ1.1.1.1/2024",{"$f":"INDEX(Financeiro[Descrição da ação],MATCH(B44,Financeiro[ID Ação], 0))","v":"Elaboração de estudos para ampliação e melhoria dos sistemas de coleta de esgotos"},{"$f":"IF(INDEX('Acompanhamento das metas 24-27'!$C$2:$C$50,MATCH(B44,'Acompanhamento das metas 24-27'!$A$2:$A$50,0))<>0,INDEX('Acompanhamento das metas 24-27'!$C$2:$C$50,MATCH(B44,'Acompanhamento das metas 24-27'!$A$2:$A$50,0)),\"\")","v":"Elaboração de ao menos 01 estudo"},{"$f":"IF(VLOOKUP(A44,Financeiro[[id_ação_Fonte_oculta]:[R$  Executado (2027)]],4,FALSE)=0,\"\",VLOOKUP(A44,Financeiro[[id_ação_Fonte_oculta]:[R$  Executado (2027)]],4,FALSE))","v":"Outras fontes"},{"$f":"IF(VLOOKUP(A44,Financeiro[[id_ação_Fonte_oculta]:[R$  Executado (2027)]],4,FALSE)=0,\"\",VLOOKUP(A44,Financeiro[[id_ação_Fonte_oculta]:[R$  Executado (2027)]],5,FALSE))","v":0},{"$f":"IF(VLOOKUP(A44,Financeiro[[id_ação_Fonte_oculta]:[R$  Executado (2027)]],4,FALSE)=0,\"\",VLOOKUP(A44,Financeiro[[id_ação_Fonte_oculta]:[R$  Executado (2027)]],8,FALSE))","v":0},{"$f":"IF(VLOOKUP(A44,Financeiro[[id_ação_Fonte_oculta]:[R$  Executado (2027)]],4,FALSE)=0,\"\",VLOOKUP(A44,Financeiro[[id_ação_Fonte_oculta]:[R$  Executado (2027)]],11,FALSE))","v":0},{"$f":"IF(VLOOKUP(A44,Financeiro[[id_ação_Fonte_oculta]:[R$  Executado (2027)]],4,FALSE)=0,\"\",VLOOKUP(A44,Financeiro[[id_ação_Fonte_oculta]:[R$  Executado (2027)]],14,FALSE))","v":0},0,{"$f":"IFERROR(INDEX(IdentAcoes[SubPDC],MATCH(B44,IdentAcoes[ID Ação],0)),\"\")","v":"1.2 - Planejamento"},{"$f":"IFERROR(INDEX(IdentAcoes[Prioridade do PDC],MATCH(B44,IdentAcoes[ID Ação],0)),\"\")","v":"PDC 1 e 2"},{"$f":"IFERROR(INDEX(IdentAcoes[Segmento do executor],MATCH($B44,IdentAcoes[ID Ação],0)),\"\")","v":"Município"},{"$f":"IFERROR(INDEX(IdentAcoes[Área de abrangência],MATCH($B44,IdentAcoes[ID Ação],0)),\"\")","v":"Município"},{"$f":"IFERROR(INDEX(IdentAcoes[Detalhamento da área de abrangência],MATCH($B44,IdentAcoes[ID Ação],0)),\"\")","v":"Municípios com prioridades para coleta, no Plano de Bacias"}]
["PCJ2.2.3.1/2024Cobrança Federal","PCJ2.2.3.1/2024",{"$f":"INDEX(Financeiro[Descrição da ação],MATCH(B45,Financeiro[ID Ação], 0))","v":"Acompanhamento e apoio aos estudos de viabilidade, projetos de engenharia e licenciamento ambiental das barragens de Pedreira, Duas Pontes e do ribeirão Piraí e do trecho Oeste do SAR"},{"$f":"IF(INDEX('Acompanhamento das metas 24-27'!$C$2:$C$50,MATCH(B45,'Acompanhamento das metas 24-27'!$A$2:$A$50,0))<>0,INDEX('Acompanhamento das metas 24-27'!$C$2:$C$50,MATCH(B45,'Acompanhamento das metas 24-27'!$A$2:$A$50,0)),\"\")","v":"Criação de GT para acompanhamento"},{"$f":"IF(VLOOKUP(A45,Financeiro[[id_ação_Fonte_oculta]:[R$  Executado (2027)]],4,FALSE)=0,\"\",VLOOKUP(A45,Financeiro[[id_ação_Fonte_oculta]:[R$  Executado (2027)]],4,FALSE))","v":"Cobrança Federal"},{"$f":"IF(VLOOKUP(A45,Financeiro[[id_ação_Fonte_oculta]:[R$  Executado (2027)]],4,FALSE)=0,\"\",VLOOKUP(A45,Financeiro[[id_ação_Fonte_oculta]:[R$  Executado (2027)]],5,FALSE))","v":387303.25},{"$f":"IF(VLOOKUP(A45,Financeiro[[id_ação_Fonte_oculta]:[R$  Executado (2027)]],4,FALSE)=0,\"\",VLOOKUP(A45,Financeiro[[id_ação_Fonte_oculta]:[R$  Executado (2027)]],8,FALSE))","v":0},{"$f":"IF(VLOOKUP(A45,Financeiro[[id_ação_Fonte_oculta]:[R$  Executado (2027)]],4,FALSE)=0,\"\",VLOOKUP(A45,Financeiro[[id_ação_Fonte_oculta]:[R$  Executado (2027)]],11,FALSE))","v":0},{"$f":"IF(VLOOKUP(A45,Financeiro[[id_ação_Fonte_oculta]:[R$  Executado (2027)]],4,FALSE)=0,\"\",VLOOKUP(A45,Financeiro[[id_ação_Fonte_oculta]:[R$  Executado (2027)]],14,FALSE))","v":0},387303.25,{"$f":"IFERROR(INDEX(IdentAcoes[SubPDC],MATCH(B45,IdentAcoes[ID Ação],0)),\"\")","v":"1.2 - Planejamento"},{"$f":"IFERROR(INDEX(IdentAcoes[Prioridade do PDC],MATCH(B45,IdentAcoes[ID Ação],0)),\"\")","v":"PDC 1 e 2"},{"$f":"IFERROR(INDEX(IdentAcoes[Segmento do executor],MATCH($B45,IdentAcoes[ID Ação],0)),\"\")","v":"Sociedade Civil"},{"$f":"IFERROR(INDEX(IdentAcoes[Área de abrangência],MATCH($B45,IdentAcoes[ID Ação],0)),\"\")","v":"Bacia"},{"$f":"IFERROR(INDEX(IdentAcoes[Detalhamento da área de abrangência],MATCH($B45,IdentAcoes[ID Ação],0)),\"\")","v":"Bacias PCJ"}]
["PCJ2.3.3.1/2024Cobrança Federal","PCJ2.3.3.1/2024",{"$f":"INDEX(Financeiro[Descrição da ação],MATCH(B46,Financeiro[ID Ação], 0))","v":"Elaboração de um guia de manejo de drenagem e manejo de águas pluviais"},{"$f":"IF(INDEX('Acompanhamento das metas 24-27'!$C$2:$C$50,MATCH(B46,'Acompanhamento das metas 24-27'!$A$2:$A$50,0))<>0,INDEX('Acompanhamento das metas 24-27'!$C$2:$C$50,MATCH(B46,'Acompanhamento das metas 24-27'!$A$2:$A$50,0)),\"\")","v":"01 Manual elaborado"},{"$f":"IF(VLOOKUP(A46,Financeiro[[id_ação_Fonte_oculta]:[R$  Executado (2027)]],4,FALSE)=0,\"\",VLOOKUP(A46,Financeiro[[id_ação_Fonte_oculta]:[R$  Executado (2027)]],4,FALSE))","v":"Cobrança Federal"},{"$f":"IF(VLOOKUP(A46,Financeiro[[id_ação_Fonte_oculta]:[R$  Executado (2027)]],4,FALSE)=0,\"\",VLOOKUP(A46,Financeiro[[id_ação_Fonte_oculta]:[R$  Executado (2027)]],5,FALSE))","v":170000},{"$f":"IF(VLOOKUP(A46,Financeiro[[id_ação_Fonte_oculta]:[R$  Executado (2027)]],4,FALSE)=0,\"\",VLOOKUP(A46,Financeiro[[id_ação_Fonte_oculta]:[R$  Executado (2027)]],8,FALSE))","v":0},{"$f":"IF(VLOOKUP(A46,Financeiro[[id_ação_Fonte_oculta]:[R$  Executado (2027)]],4,FALSE)=0,\"\",VLOOKUP(A46,Financeiro[[id_ação_Fonte_oculta]:[R$  Executado (2027)]],11,FALSE))","v":0},{"$f":"IF(VLOOKUP(A46,Financeiro[[id_ação_Fonte_oculta]:[R$  Executado (2027)]],4,FALSE)=0,\"\",VLOOKUP(A46,Financeiro[[id_ação_Fonte_oculta]:[R$  Executado (2027)]],14,FALSE))","v":0},170000,{"$f":"IFERROR(INDEX(IdentAcoes[SubPDC],MATCH(B46,IdentAcoes[ID Ação],0)),\"\")","v":"1.2 - Planejamento"},{"$f":"IFERROR(INDEX(IdentAcoes[Prioridade do PDC],MATCH(B46,IdentAcoes[ID Ação],0)),\"\")","v":"PDC 1 e 2"},{"$f":"IFERROR(INDEX(IdentAcoes[Segmento do executor],MATCH($B46,IdentAcoes[ID Ação],0)),\"\")","v":"Sociedade Civil"},{"$f":"IFERROR(INDEX(IdentAcoes[Área de abrangência],MATCH($B46,IdentAcoes[ID Ação],0)),\"\")","v":"Bacia"},{"$f":"IFERROR(INDEX(IdentAcoes[Detalhamento da área de abrangência],MATCH($B46,IdentAcoes[ID Ação],0)),\"\")","v":"Bacias PCJ"}]
["PCJ1.3.1.2/2025Cobrança Federal","PCJ1.3.1.2/2025",{"$f":"INDEX(Financeiro[Descrição da ação],MATCH(B47,Financeiro[ID Ação], 0))","v":"Elaboração de estudo piloto para avaliação da carga difusa de origem urbana e rural afluente nos corpos hídricos das Bacias PCJ"},{"$f":"IF(INDEX('Acompanhamento das metas 24-27'!$C$2:$C$50,MATCH(B47,'Acompanhamento das metas 24-27'!$A$2:$A$50,0))<>0,INDEX('Acompanhamento das metas 24-27'!$C$2:$C$50,MATCH(B47,'Acompanhamento das metas 24-27'!$A$2:$A$50,0)),\"\")","v":"01 estudo elaborado"},{"$f":"IF(VLOOKUP(A47,Financeiro[[id_ação_Fonte_oculta]:[R$  Executado (2027)]],4,FALSE)=0,\"\",VLOOKUP(A47,Financeiro[[id_ação_Fonte_oculta]:[R$  Executado (2027)]],4,FALSE))","v":"Cobrança Federal"},{"$f":"IF(VLOOKUP(A47,Financeiro[[id_ação_Fonte_oculta]:[R$  Executado (2027)]],4,FALSE)=0,\"\",VLOOKUP(A47,Financeiro[[id_ação_Fonte_oculta]:[R$  Executado (2027)]],5,FALSE))","v":0},{"$f":"IF(VLOOKUP(A47,Financeiro[[id_ação_Fonte_oculta]:[R$  Executado (2027)]],4,FALSE)=0,\"\",VLOOKUP(A47,Financeiro[[id_ação_Fonte_oculta]:[R$  Executado (2027)]],8,FALSE))","v":490046.84125302196},{"$f":"IF(VLOOKUP(A47,Financeiro[[id_ação_Fonte_oculta]:[R$  Executado (2027)]],4,FALSE)=0,\"\",VLOOKUP(A47,Financeiro[[id_ação_Fonte_oculta]:[R$  Executado (2027)]],11,FALSE))","v":0},{"$f":"IF(VLOOKUP(A47,Financeiro[[id_ação_Fonte_oculta]:[R$  Executado (2027)]],4,FALSE)=0,\"\",VLOOKUP(A47,Financeiro[[id_ação_Fonte_oculta]:[R$  Executado (2027)]],14,FALSE))","v":0},490046.84125302196,{"$f":"IFERROR(INDEX(IdentAcoes[SubPDC],MATCH(B47,IdentAcoes[ID Ação],0)),\"\")","v":"1.2 - Planejamento"},{"$f":"IFERROR(INDEX(IdentAcoes[Prioridade do PDC],MATCH(B47,IdentAcoes[ID Ação],0)),\"\")","v":"PDC 1 e 2"},{"$f":"IFERROR(INDEX(IdentAcoes[Segmento do executor],MATCH($B47,IdentAcoes[ID Ação],0)),\"\")","v":"Sociedade Civil"},{"$f":"IFERROR(INDEX(IdentAcoes[Área de abrangência],MATCH($B47,IdentAcoes[ID Ação],0)),\"\")","v":"Bacia"},{"$f":"IFERROR(INDEX(IdentAcoes[Detalhamento da área de abrangência],MATCH($B47,IdentAcoes[ID Ação],0)),\"\")","v":"Bacias PCJ"}]
["PCJ6.2.5.3/2024Cobrança Federal","PCJ6.2.5.3/2024",{"$f":"INDEX(Financeiro[Descrição da ação],MATCH(B48,Financeiro[ID Ação], 0))","v":"Apoio operacional para fiscalização de outorgas"},{"$f":"IF(INDEX('Acompanhamento das metas 24-27'!$C$2:$C$50,MATCH(B48,'Acompanhamento das metas 24-27'!$A$2:$A$50,0))<>0,INDEX('Acompanhamento das metas 24-27'!$C$2:$C$50,MATCH(B48,'Acompanhamento das metas 24-27'!$A$2:$A$50,0)),\"\")","v":"Apoio operacional contínuo"},{"$f":"IF(VLOOKUP(A48,Financeiro[[id_ação_Fonte_oculta]:[R$  Executado (2027)]],4,FALSE)=0,\"\",VLOOKUP(A48,Financeiro[[id_ação_Fonte_oculta]:[R$  Executado (2027)]],4,FALSE))","v":"Cobrança Federal"},{"$f":"IF(VLOOKUP(A48,Financeiro[[id_ação_Fonte_oculta]:[R$  Executado (2027)]],4,FALSE)=0,\"\",VLOOKUP(A48,Financeiro[[id_ação_Fonte_oculta]:[R$  Executado (2027)]],5,FALSE))","v":2200000},{"$f":"IF(VLOOKUP(A48,Financeiro[[id_ação_Fonte_oculta]:[R$  Executado (2027)]],4,FALSE)=0,\"\",VLOOKUP(A48,Financeiro[[id_ação_Fonte_oculta]:[R$  Executado (2027)]],8,FALSE))","v":1400000},{"$f":"IF(VLOOKUP(A48,Financeiro[[id_ação_Fonte_oculta]:[R$  Executado (2027)]],4,FALSE)=0,\"\",VLOOKUP(A48,Financeiro[[id_ação_Fonte_oculta]:[R$  Executado (2027)]],11,FALSE))","v":0},{"$f":"IF(VLOOKUP(A48,Financeiro[[id_ação_Fonte_oculta]:[R$  Executado (2027)]],4,FALSE)=0,\"\",VLOOKUP(A48,Financeiro[[id_ação_Fonte_oculta]:[R$  Executado (2027)]],14,FALSE))","v":0},3600000,{"$f":"IFERROR(INDEX(IdentAcoes[SubPDC],MATCH(B48,IdentAcoes[ID Ação],0)),\"\")","v":"2.2 - Outorga"},{"$f":"IFERROR(INDEX(IdentAcoes[Prioridade do PDC],MATCH(B48,IdentAcoes[ID Ação],0)),\"\")","v":"PDC 1 e 2"},{"$f":"IFERROR(INDEX(IdentAcoes[Segmento do executor],MATCH($B48,IdentAcoes[ID Ação],0)),\"\")","v":"Sociedade Civil"},{"$f":"IFERROR(INDEX(IdentAcoes[Área de abrangência],MATCH($B48,IdentAcoes[ID Ação],0)),\"\")","v":"Bacia"},{"$f":"IFERROR(INDEX(IdentAcoes[Detalhamento da área de abrangência],MATCH($B48,IdentAcoes[ID Ação],0)),\"\")","v":"Bacias PCJ"}]
["PCJ6.1.1.2/2024Cobrança Federal","PCJ6.1.1.2/2024",{"$f":"INDEX(Financeiro[Descrição da ação],MATCH(B49,Financeiro[ID Ação], 0))","v":"Apoio operacional para a área de cobrança pelo uso dos recursos hídricos"},{"$f":"IF(INDEX('Acompanhamento das metas 24-27'!$C$2:$C$50,MATCH(B49,'Acompanhamento das metas 24-27'!$A$2:$A$50,0))<>0,INDEX('Acompanhamento das metas 24-27'!$C$2:$C$50,MATCH(B49,'Acompanhamento das metas 24-27'!$A$2:$A$50,0)),\"\")","v":"Apoio operacional contínuo"},{"$f":"IF(VLOOKUP(A49,Financeiro[[id_ação_Fonte_oculta]:[R$  Executado (2027)]],4,FALSE)=0,\"\",VLOOKUP(A49,Financeiro[[id_ação_Fonte_oculta]:[R$  Executado (2027)]],4,FALSE))","v":"Cobrança Federal"},{"$f":"IF(VLOOKUP(A49,Financeiro[[id_ação_Fonte_oculta]:[R$  Executado (2027)]],4,FALSE)=0,\"\",VLOOKUP(A49,Financeiro[[id_ação_Fonte_oculta]:[R$  Executado (2027)]],5,FALSE))","v":3715960.39},{"$f":"IF(VLOOKUP(A49,Financeiro[[id_ação_Fonte_oculta]:[R$  Executado (2027)]],4,FALSE)=0,\"\",VLOOKUP(A49,Financeiro[[id_ação_Fonte_oculta]:[R$  Executado (2027)]],8,FALSE))","v":3822087.0821859101},{"$f":"IF(VLOOKUP(A49,Financeiro[[id_ação_Fonte_oculta]:[R$  Executado (2027)]],4,FALSE)=0,\"\",VLOOKUP(A49,Financeiro[[id_ação_Fonte_oculta]:[R$  Executado (2027)]],11,FALSE))","v":0},{"$f":"IF(VLOOKUP(A49,Financeiro[[id_ação_Fonte_oculta]:[R$  Executado (2027)]],4,FALSE)=0,\"\",VLOOKUP(A49,Financeiro[[id_ação_Fonte_oculta]:[R$  Executado (2027)]],14,FALSE))","v":0},7538047.4721859097,{"$f":"IFERROR(INDEX(IdentAcoes[SubPDC],MATCH(B49,IdentAcoes[ID Ação],0)),\"\")","v":"2.3 - Cobrança"},{"$f":"IFERROR(INDEX(IdentAcoes[Prioridade do PDC],MATCH(B49,IdentAcoes[ID Ação],0)),\"\")","v":"PDC 1 e 2"},{"$f":"IFERROR(INDEX(IdentAcoes[Segmento do executor],MATCH($B49,IdentAcoes[ID Ação],0)),\"\")","v":"Sociedade Civil"},{"$f":"IFERROR(INDEX(IdentAcoes[Área de abrangência],MATCH($B49,IdentAcoes[ID Ação],0)),\"\")","v":"Bacia"},{"$f":"IFERROR(INDEX(IdentAcoes[Detalhamento da área de abrangência],MATCH($B49,IdentAcoes[ID Ação],0)),\"\")","v":"Bacias PCJ"}]
["PCJ6.1.1.5/2024Cobrança Federal","PCJ6.1.1.5/2024",{"$f":"INDEX(Financeiro[Descrição da ação],MATCH(B50,Financeiro[ID Ação], 0))","v":"Apoio operacional para acompanhamento de projetos da área de Sistema de Informações "},{"$f":"IF(INDEX('Acompanhamento das metas 24-27'!$C$2:$C$50,MATCH(B50,'Acompanhamento das metas 24-27'!$A$2:$A$50,0))<>0,INDEX('Acompanhamento das metas 24-27'!$C$2:$C$50,MATCH(B50,'Acompanhamento das metas 24-27'!$A$2:$A$50,0)),\"\")","v":"Apoio operacional contínuo"},{"$f":"IF(VLOOKUP(A50,Financeiro[[id_ação_Fonte_oculta]:[R$  Executado (2027)]],4,FALSE)=0,\"\",VLOOKUP(A50,Financeiro[[id_ação_Fonte_oculta]:[R$  Executado (2027)]],4,FALSE))","v":"Cobrança Federal"},{"$f":"IF(VLOOKUP(A50,Financeiro[[id_ação_Fonte_oculta]:[R$  Executado (2027)]],4,FALSE)=0,\"\",VLOOKUP(A50,Financeiro[[id_ação_Fonte_oculta]:[R$  Executado (2027)]],5,FALSE))","v":3200000},{"$f":"IF(VLOOKUP(A50,Financeiro[[id_ação_Fonte_oculta]:[R$  Executado (2027)]],4,FALSE)=0,\"\",VLOOKUP(A50,Financeiro[[id_ação_Fonte_oculta]:[R$  Executado (2027)]],8,FALSE))","v":3200000},{"$f":"IF(VLOOKUP(A50,Financeiro[[id_ação_Fonte_oculta]:[R$  Executado (2027)]],4,FALSE)=0,\"\",VLOOKUP(A50,Financeiro[[id_ação_Fonte_oculta]:[R$  Executado (2027)]],11,FALSE))","v":0},{"$f":"IF(VLOOKUP(A50,Financeiro[[id_ação_Fonte_oculta]:[R$  Executado (2027)]],4,FALSE)=0,\"\",VLOOKUP(A50,Financeiro[[id_ação_Fonte_oculta]:[R$  Executado (2027)]],14,FALSE))","v":0},6400000,{"$f":"IFERROR(INDEX(IdentAcoes[SubPDC],MATCH(B50,IdentAcoes[ID Ação],0)),\"\")","v":"2.5 - Redes de monitoramento e SI"},{"$f":"IFERROR(INDEX(IdentAcoes[Prioridade do PDC],MATCH(B50,IdentAcoes[ID Ação],0)),\"\")","v":"PDC 1 e 2"},{"$f":"IFERROR(INDEX(IdentAcoes[Segmento do executor],MATCH($B50,IdentAcoes[ID Ação],0)),\"\")","v":"Sociedade Civil"},{"$f":"IFERROR(INDEX(IdentAcoes[Área de abrangência],MATCH($B50,IdentAcoes[ID Ação],0)),\"\")","v":"Bacia"},{"$f":"IFERROR(INDEX(IdentAcoes[Detalhamento da área de abrangência],MATCH($B50,IdentAcoes[ID Ação],0)),\"\")","v":"Bacias PCJ"}]
["PCJ6.2.3.1/2024Cobrança Federal","PCJ6.2.3.1/2024",{"$f":"INDEX(Financeiro[Descrição da ação],MATCH(B51,Financeiro[ID Ação], 0))","v":"Expansão, integração, operação e manutenção da rede de monitoramento quali-quantitativo dos recursos hídricos"},{"$f":"IF(INDEX('Acompanhamento das metas 24-27'!$C$2:$C$50,MATCH(B51,'Acompanhamento das metas 24-27'!$A$2:$A$50,0))<>0,INDEX('Acompanhamento das metas 24-27'!$C$2:$C$50,MATCH(B51,'Acompanhamento das metas 24-27'!$A$2:$A$50,0)),\"\")","v":"Disponibilização de dados de ao menos 36 postos ativos"},{"$f":"IF(VLOOKUP(A51,Financeiro[[id_ação_Fonte_oculta]:[R$  Executado (2027)]],4,FALSE)=0,\"\",VLOOKUP(A51,Financeiro[[id_ação_Fonte_oculta]:[R$  Executado (2027)]],4,FALSE))","v":"Cobrança Federal"},{"$f":"IF(VLOOKUP(A51,Financeiro[[id_ação_Fonte_oculta]:[R$  Executado (2027)]],4,FALSE)=0,\"\",VLOOKUP(A51,Financeiro[[id_ação_Fonte_oculta]:[R$  Executado (2027)]],5,FALSE))","v":5183320.4400000004},{"$f":"IF(VLOOKUP(A51,Financeiro[[id_ação_Fonte_oculta]:[R$  Executado (2027)]],4,FALSE)=0,\"\",VLOOKUP(A51,Financeiro[[id_ação_Fonte_oculta]:[R$  Executado (2027)]],8,FALSE))","v":4340020.0145200007},{"$f":"IF(VLOOKUP(A51,Financeiro[[id_ação_Fonte_oculta]:[R$  Executado (2027)]],4,FALSE)=0,\"\",VLOOKUP(A51,Financeiro[[id_ação_Fonte_oculta]:[R$  Executado (2027)]],11,FALSE))","v":0},{"$f":"IF(VLOOKUP(A51,Financeiro[[id_ação_Fonte_oculta]:[R$  Executado (2027)]],4,FALSE)=0,\"\",VLOOKUP(A51,Financeiro[[id_ação_Fonte_oculta]:[R$  Executado (2027)]],14,FALSE))","v":0},9523340.454520002,{"$f":"IFERROR(INDEX(IdentAcoes[SubPDC],MATCH(B51,IdentAcoes[ID Ação],0)),\"\")","v":"2.5 - Redes de monitoramento e SI"},{"$f":"IFERROR(INDEX(IdentAcoes[Prioridade do PDC],MATCH(B51,IdentAcoes[ID Ação],0)),\"\")","v":"PDC 1 e 2"},{"$f":"IFERROR(INDEX(IdentAcoes[Segmento do executor],MATCH($B51,IdentAcoes[ID Ação],0)),\"\")","v":"Sociedade Civil"},{"$f":"IFERROR(INDEX(IdentAcoes[Área de abrangência],MATCH($B51,IdentAcoes[ID Ação],0)),\"\")","v":"Bacia"},{"$f":"IFERROR(INDEX(IdentAcoes[Detalhamento da área de abrangência],MATCH($B51,IdentAcoes[ID Ação],0)),\"\")","v":"Bacias PCJ"}]
["PCJ2.1.1.1/2024Cobrança Federal","PCJ2.1.1.1/2024",{"$f":"INDEX(Financeiro[Descrição da ação],MATCH(B52,Financeiro[ID Ação], 0))","v":"Manutenção e aprimoramento de um modelo chuva-vazão para as Bacias PCJ"},{"$f":"IF(INDEX('Acompanhamento das metas 24-27'!$C$2:$C$100,MATCH(B52,'Acompanhamento das metas 24-27'!$A$2:$A$50,0))<>0,INDEX('Acompanhamento das metas 24-27'!$C$2:$C$50,MATCH(B52,'Acompanhamento das metas 24-27'!$A$2:$A$50,0)),\"\")","v":"Disponibilidade de ao menos 01 modelo"},{"$f":"IF(VLOOKUP(A52,Financeiro[[id_ação_Fonte_oculta]:[R$  Executado (2027)]],4,FALSE)=0,\"\",VLOOKUP(A52,Financeiro[[id_ação_Fonte_oculta]:[R$  Executado (2027)]],4,FALSE))","v":"Cobrança Federal"},{"$f":"IF(VLOOKUP(A52,Financeiro[[id_ação_Fonte_oculta]:[R$  Executado (2027)]],4,FALSE)=0,\"\",VLOOKUP(A52,Financeiro[[id_ação_Fonte_oculta]:[R$  Executado (2027)]],5,FALSE))","v":538170.04},{"$f":"IF(VLOOKUP(A52,Financeiro[[id_ação_Fonte_oculta]:[R$  Executado (2027)]],4,FALSE)=0,\"\",VLOOKUP(A52,Financeiro[[id_ação_Fonte_oculta]:[R$  Executado (2027)]],8,FALSE))","v":555929.6498637161},{"$f":"IF(VLOOKUP(A52,Financeiro[[id_ação_Fonte_oculta]:[R$  Executado (2027)]],4,FALSE)=0,\"\",VLOOKUP(A52,Financeiro[[id_ação_Fonte_oculta]:[R$  Executado (2027)]],11,FALSE))","v":0},{"$f":"IF(VLOOKUP(A52,Financeiro[[id_ação_Fonte_oculta]:[R$  Executado (2027)]],4,FALSE)=0,\"\",VLOOKUP(A52,Financeiro[[id_ação_Fonte_oculta]:[R$  Executado (2027)]],14,FALSE))","v":0},1094099.6898637163,{"$f":"IFERROR(INDEX(IdentAcoes[SubPDC],MATCH(B52,IdentAcoes[ID Ação],0)),\"\")","v":"2.5 - Redes de monitoramento e SI"},{"$f":"IFERROR(INDEX(IdentAcoes[Prioridade do PDC],MATCH(B52,IdentAcoes[ID Ação],0)),\"\")","v":"PDC 1 e 2"},{"$f":"IFERROR(INDEX(IdentAcoes[Segmento do executor],MATCH($B52,IdentAcoes[ID Ação],0)),\"\")","v":"Sociedade Civil"},{"$f":"IFERROR(INDEX(IdentAcoes[Área de abrangência],MATCH($B52,IdentAcoes[ID Ação],0)),\"\")","v":"Bacia"},{"$f":"IFERROR(INDEX(IdentAcoes[Detalhamento da área de abrangência],MATCH($B52,IdentAcoes[ID Ação],0)),\"\")","v":"Bacias PCJ"}]
["PCJ2.1.2.1/2025Cobrança Federal","PCJ2.1.2.1/2025",{"$f":"INDEX(Financeiro[Descrição da ação],MATCH(B53,Financeiro[ID Ação], 0))","v":"Aprimoramento de modelo de simulação hidrodinâmica do tempo de trânsito e do amortecimento da vazão preferencialmente à jusante do Sistema Cantareira"},{"$f":"IF(INDEX('Acompanhamento das metas 24-27'!$C$2:$C$100,MATCH(B53,'Acompanhamento das metas 24-27'!$A$2:$A$100,0))<>0,INDEX('Acompanhamento das metas 24-27'!$C$2:$C$100,MATCH(B53,'Acompanhamento das metas 24-27'!$A$2:$A$100,0)),\"\")","v":"01 modelo calibrado"},{"$f":"IF(VLOOKUP(A53,Financeiro[[id_ação_Fonte_oculta]:[R$  Executado (2027)]],4,FALSE)=0,\"\",VLOOKUP(A53,Financeiro[[id_ação_Fonte_oculta]:[R$  Executado (2027)]],4,FALSE))","v":"Cobrança Federal"},{"$f":"IF(VLOOKUP(A53,Financeiro[[id_ação_Fonte_oculta]:[R$  Executado (2027)]],4,FALSE)=0,\"\",VLOOKUP(A53,Financeiro[[id_ação_Fonte_oculta]:[R$  Executado (2027)]],5,FALSE))","v":0},{"$f":"IF(VLOOKUP(A53,Financeiro[[id_ação_Fonte_oculta]:[R$  Executado (2027)]],4,FALSE)=0,\"\",VLOOKUP(A53,Financeiro[[id_ação_Fonte_oculta]:[R$  Executado (2027)]],8,FALSE))","v":541863.21},{"$f":"IF(VLOOKUP(A53,Financeiro[[id_ação_Fonte_oculta]:[R$  Executado (2027)]],4,FALSE)=0,\"\",VLOOKUP(A53,Financeiro[[id_ação_Fonte_oculta]:[R$  Executado (2027)]],11,FALSE))","v":0},{"$f":"IF(VLOOKUP(A53,Financeiro[[id_ação_Fonte_oculta]:[R$  Executado (2027)]],4,FALSE)=0,\"\",VLOOKUP(A53,Financeiro[[id_ação_Fonte_oculta]:[R$  Executado (2027)]],14,FALSE))","v":0},541863.21,{"$f":"IFERROR(INDEX(IdentAcoes[SubPDC],MATCH(B53,IdentAcoes[ID Ação],0)),\"\")","v":"2.5 - Redes de monitoramento e SI"},{"$f":"IFERROR(INDEX(IdentAcoes[Prioridade do PDC],MATCH(B53,IdentAcoes[ID Ação],0)),\"\")","v":"PDC 1 e 2"},{"$f":"IFERROR(INDEX(IdentAcoes[Segmento do executor],MATCH($B53,IdentAcoes[ID Ação],0)),\"\")","v":"Sociedade Civil"},{"$f":"IFERROR(INDEX(IdentAcoes[Área de abrangência],MATCH($B53,IdentAcoes[ID Ação],0)),\"\")","v":"Bacia"},{"$f":"IFERROR(INDEX(IdentAcoes[Detalhamento da área de abrangência],MATCH($B53,IdentAcoes[ID Ação],0)),\"\")","v":"Bacias PCJ"}]
["PCJ6.2.6.1/2024Cobrança Federal","PCJ6.2.6.1/2024",{"$f":"INDEX(Financeiro[Descrição da ação],MATCH(B54,Financeiro[ID Ação], 0))","v":"Apoio operacional para gerenciamento da implementação e da revisão do Plano de Bacias"},{"$f":"IF(INDEX('Acompanhamento das metas 24-27'!$C$2:$C$100,MATCH(B54,'Acompanhamento das metas 24-27'!$A$2:$A$100,0))<>0,INDEX('Acompanhamento das metas 24-27'!$C$2:$C$100,MATCH(B54,'Acompanhamento das metas 24-27'!$A$2:$A$100,0)),\"\")","v":"Contratação de ao menos 01 pessoa"},{"$f":"IF(VLOOKUP(A54,Financeiro[[id_ação_Fonte_oculta]:[R$  Executado (2027)]],4,FALSE)=0,\"\",VLOOKUP(A54,Financeiro[[id_ação_Fonte_oculta]:[R$  Executado (2027)]],4,FALSE))","v":"Cobrança Federal"},{"$f":"IF(VLOOKUP(A54,Financeiro[[id_ação_Fonte_oculta]:[R$  Executado (2027)]],4,FALSE)=0,\"\",VLOOKUP(A54,Financeiro[[id_ação_Fonte_oculta]:[R$  Executado (2027)]],5,FALSE))","v":1869464.32},{"$f":"IF(VLOOKUP(A54,Financeiro[[id_ação_Fonte_oculta]:[R$  Executado (2027)]],4,FALSE)=0,\"\",VLOOKUP(A54,Financeiro[[id_ação_Fonte_oculta]:[R$  Executado (2027)]],8,FALSE))","v":1898156.6425600001},{"$f":"IF(VLOOKUP(A54,Financeiro[[id_ação_Fonte_oculta]:[R$  Executado (2027)]],4,FALSE)=0,\"\",VLOOKUP(A54,Financeiro[[id_ação_Fonte_oculta]:[R$  Executado (2027)]],11,FALSE))","v":0},{"$f":"IF(VLOOKUP(A54,Financeiro[[id_ação_Fonte_oculta]:[R$  Executado (2027)]],4,FALSE)=0,\"\",VLOOKUP(A54,Financeiro[[id_ação_Fonte_oculta]:[R$  Executado (2027)]],14,FALSE))","v":0},3767620.9625599999,{"$f":"IFERROR(INDEX(IdentAcoes[SubPDC],MATCH(B54,IdentAcoes[ID Ação],0)),\"\")","v":"2.6 - Integração"},{"$f":"IFERROR(INDEX(IdentAcoes[Prioridade do PDC],MATCH(B54,IdentAcoes[ID Ação],0)),\"\")","v":"PDC 1 e 2"},{"$f":"IFERROR(INDEX(IdentAcoes[Segmento do executor],MATCH($B54,IdentAcoes[ID Ação],0)),\"\")","v":"Sociedade Civil"},{"$f":"IFERROR(INDEX(IdentAcoes[Área de abrangência],MATCH($B54,IdentAcoes[ID Ação],0)),\"\")","v":"Bacia"},{"$f":"IFERROR(INDEX(IdentAcoes[Detalhamento da área de abrangência],MATCH($B54,IdentAcoes[ID Ação],0)),\"\")","v":"Bacias PCJ"}]
["PCJ6.1.1.4/2024Cobrança Federal","PCJ6.1.1.4/2024",{"$f":"INDEX(Financeiro[Descrição da ação],MATCH(B55,Financeiro[ID Ação], 0))","v":"Apoio Operacional para acompanhamento de empreendimentos de demanda espontânea"},{"$f":"IF(INDEX('Acompanhamento das metas 24-27'!$C$2:$C$100,MATCH(B55,'Acompanhamento das metas 24-27'!$A$2:$A$100,0))<>0,INDEX('Acompanhamento das metas 24-27'!$C$2:$C$100,MATCH(B55,'Acompanhamento das metas 24-27'!$A$2:$A$100,0)),\"\")","v":"Remuneração de agentes técnicos e financeiros para empreendimentos deliberados pelos Comitês PCJ"},{"$f":"IF(VLOOKUP(A55,Financeiro[[id_ação_Fonte_oculta]:[R$  Executado (2027)]],4,FALSE)=0,\"\",VLOOKUP(A55,Financeiro[[id_ação_Fonte_oculta]:[R$  Executado (2027)]],4,FALSE))","v":"Cobrança Federal"},{"$f":"IF(VLOOKUP(A55,Financeiro[[id_ação_Fonte_oculta]:[R$  Executado (2027)]],4,FALSE)=0,\"\",VLOOKUP(A55,Financeiro[[id_ação_Fonte_oculta]:[R$  Executado (2027)]],5,FALSE))","v":1506712.43},{"$f":"IF(VLOOKUP(A55,Financeiro[[id_ação_Fonte_oculta]:[R$  Executado (2027)]],4,FALSE)=0,\"\",VLOOKUP(A55,Financeiro[[id_ação_Fonte_oculta]:[R$  Executado (2027)]],8,FALSE))","v":1556433.9390976413},{"$f":"IF(VLOOKUP(A55,Financeiro[[id_ação_Fonte_oculta]:[R$  Executado (2027)]],4,FALSE)=0,\"\",VLOOKUP(A55,Financeiro[[id_ação_Fonte_oculta]:[R$  Executado (2027)]],11,FALSE))","v":0},{"$f":"IF(VLOOKUP(A55,Financeiro[[id_ação_Fonte_oculta]:[R$  Executado (2027)]],4,FALSE)=0,\"\",VLOOKUP(A55,Financeiro[[id_ação_Fonte_oculta]:[R$  Executado (2027)]],14,FALSE))","v":0},3063146.3690976412,{"$f":"IFERROR(INDEX(IdentAcoes[SubPDC],MATCH(B55,IdentAcoes[ID Ação],0)),\"\")","v":"2.6 - Integração"},{"$f":"IFERROR(INDEX(IdentAcoes[Prioridade do PDC],MATCH(B55,IdentAcoes[ID Ação],0)),\"\")","v":"PDC 1 e 2"},{"$f":"IFERROR(INDEX(IdentAcoes[Segmento do executor],MATCH($B55,IdentAcoes[ID Ação],0)),\"\")","v":"Sociedade Civil"},{"$f":"IFERROR(INDEX(IdentAcoes[Área de abrangência],MATCH($B55,IdentAcoes[ID Ação],0)),\"\")","v":"Bacia"},{"$f":"IFERROR(INDEX(IdentAcoes[Detalhamento da área de abrangência],MATCH($B55,IdentAcoes[ID Ação],0)),\"\")","v":"Bacias PCJ"}]
["PCJ6.1.2.2/2024Cobrança Federal","PCJ6.1.2.2/2024",{"$f":"INDEX(Financeiro[Descrição da ação],MATCH(B56,Financeiro[ID Ação], 0))","v":"Remuneração de agentes técnicos e financeiros para empreendimentos deliberados pelos Comitês PCJ"},{"$f":"IF(INDEX('Acompanhamento das metas 24-27'!$C$2:$C$100,MATCH(B56,'Acompanhamento das metas 24-27'!$A$2:$A$100,0))<>0,INDEX('Acompanhamento das metas 24-27'!$C$2:$C$100,MATCH(B56,'Acompanhamento das metas 24-27'!$A$2:$A$100,0)),\"\")","v":"Desembolso de ao menos 50% do valor previsto"},{"$f":"IF(VLOOKUP(A56,Financeiro[[id_ação_Fonte_oculta]:[R$  Executado (2027)]],4,FALSE)=0,\"\",VLOOKUP(A56,Financeiro[[id_ação_Fonte_oculta]:[R$  Executado (2027)]],4,FALSE))","v":"Cobrança Federal"},{"$f":"IF(VLOOKUP(A56,Financeiro[[id_ação_Fonte_oculta]:[R$  Executado (2027)]],4,FALSE)=0,\"\",VLOOKUP(A56,Financeiro[[id_ação_Fonte_oculta]:[R$  Executado (2027)]],5,FALSE))","v":1316626.55},{"$f":"IF(VLOOKUP(A56,Financeiro[[id_ação_Fonte_oculta]:[R$  Executado (2027)]],4,FALSE)=0,\"\",VLOOKUP(A56,Financeiro[[id_ação_Fonte_oculta]:[R$  Executado (2027)]],8,FALSE))","v":1316626.55},{"$f":"IF(VLOOKUP(A56,Financeiro[[id_ação_Fonte_oculta]:[R$  Executado (2027)]],4,FALSE)=0,\"\",VLOOKUP(A56,Financeiro[[id_ação_Fonte_oculta]:[R$  Executado (2027)]],11,FALSE))","v":0},{"$f":"IF(VLOOKUP(A56,Financeiro[[id_ação_Fonte_oculta]:[R$  Executado (2027)]],4,FALSE)=0,\"\",VLOOKUP(A56,Financeiro[[id_ação_Fonte_oculta]:[R$  Executado (2027)]],14,FALSE))","v":0},2633253.1,{"$f":"IFERROR(INDEX(IdentAcoes[SubPDC],MATCH(B56,IdentAcoes[ID Ação],0)),\"\")","v":"2.6 - Integração"},{"$f":"IFERROR(INDEX(IdentAcoes[Prioridade do PDC],MATCH(B56,IdentAcoes[ID Ação],0)),\"\")","v":"PDC 1 e 2"},{"$f":"IFERROR(INDEX(IdentAcoes[Segmento do executor],MATCH($B56,IdentAcoes[ID Ação],0)),\"\")","v":"Sociedade Civil"},{"$f":"IFERROR(INDEX(IdentAcoes[Área de abrangência],MATCH($B56,IdentAcoes[ID Ação],0)),\"\")","v":"Bacia"},{"$f":"IFERROR(INDEX(IdentAcoes[Detalhamento da área de abrangência],MATCH($B56,IdentAcoes[ID Ação],0)),\"\")","v":"Bacias PCJ"}]
["PCJ6.1.2.3/2024Cobrança Federal","PCJ6.1.2.3/2024",{"$f":"INDEX(Financeiro[Descrição da ação],MATCH(B57,Financeiro[ID Ação], 0))","v":"Logística de Suporte às reuniões Plenárias e das CTs dos Comitês PCJ"},{"$f":"IF(INDEX('Acompanhamento das metas 24-27'!$C$2:$C$100,MATCH(B57,'Acompanhamento das metas 24-27'!$A$2:$A$100,0))<>0,INDEX('Acompanhamento das metas 24-27'!$C$2:$C$100,MATCH(B57,'Acompanhamento das metas 24-27'!$A$2:$A$100,0)),\"\")","v":"Apoio operacional contínuo"},{"$f":"IF(VLOOKUP(A57,Financeiro[[id_ação_Fonte_oculta]:[R$  Executado (2027)]],4,FALSE)=0,\"\",VLOOKUP(A57,Financeiro[[id_ação_Fonte_oculta]:[R$  Executado (2027)]],4,FALSE))","v":"Cobrança Federal"},{"$f":"IF(VLOOKUP(A57,Financeiro[[id_ação_Fonte_oculta]:[R$  Executado (2027)]],4,FALSE)=0,\"\",VLOOKUP(A57,Financeiro[[id_ação_Fonte_oculta]:[R$  Executado (2027)]],5,FALSE))","v":400000},{"$f":"IF(VLOOKUP(A57,Financeiro[[id_ação_Fonte_oculta]:[R$  Executado (2027)]],4,FALSE)=0,\"\",VLOOKUP(A57,Financeiro[[id_ação_Fonte_oculta]:[R$  Executado (2027)]],8,FALSE))","v":400000},{"$f":"IF(VLOOKUP(A57,Financeiro[[id_ação_Fonte_oculta]:[R$  Executado (2027)]],4,FALSE)=0,\"\",VLOOKUP(A57,Financeiro[[id_ação_Fonte_oculta]:[R$  Executado (2027)]],11,FALSE))","v":0},{"$f":"IF(VLOOKUP(A57,Financeiro[[id_ação_Fonte_oculta]:[R$  Executado (2027)]],4,FALSE)=0,\"\",VLOOKUP(A57,Financeiro[[id_ação_Fonte_oculta]:[R$  Executado (2027)]],14,FALSE))","v":0},800000,{"$f":"IFERROR(INDEX(IdentAcoes[SubPDC],MATCH(B57,IdentAcoes[ID Ação],0)),\"\")","v":"2.6 - Integração"},{"$f":"IFERROR(INDEX(IdentAcoes[Prioridade do PDC],MATCH(B57,IdentAcoes[ID Ação],0)),\"\")","v":"PDC 1 e 2"},{"$f":"IFERROR(INDEX(IdentAcoes[Segmento do executor],MATCH($B57,IdentAcoes[ID Ação],0)),\"\")","v":"Sociedade Civil"},{"$f":"IFERROR(INDEX(IdentAcoes[Área de abrangência],MATCH($B57,IdentAcoes[ID Ação],0)),\"\")","v":"Bacia"},{"$f":"IFERROR(INDEX(IdentAcoes[Detalhamento da área de abrangência],MATCH($B57,IdentAcoes[ID Ação],0)),\"\")","v":"Bacias PCJ"}]
["PCJ6.1.2.1/2024Cobrança Federal","PCJ6.1.2.1/2024",{"$f":"INDEX(Financeiro[Descrição da ação],MATCH(B58,Financeiro[ID Ação], 0))","v":"Apoio operacional para a Secretaria Executiva dos Comitês PCJ"},{"$f":"IF(INDEX('Acompanhamento das metas 24-27'!$C$2:$C$100,MATCH(B58,'Acompanhamento das metas 24-27'!$A$2:$A$100,0))<>0,INDEX('Acompanhamento das metas 24-27'!$C$2:$C$100,MATCH(B58,'Acompanhamento das metas 24-27'!$A$2:$A$100,0)),\"\")","v":"Apoio operacional contínuo"},{"$f":"IF(VLOOKUP(A58,Financeiro[[id_ação_Fonte_oculta]:[R$  Executado (2027)]],4,FALSE)=0,\"\",VLOOKUP(A58,Financeiro[[id_ação_Fonte_oculta]:[R$  Executado (2027)]],4,FALSE))","v":"Cobrança Federal"},{"$f":"IF(VLOOKUP(A58,Financeiro[[id_ação_Fonte_oculta]:[R$  Executado (2027)]],4,FALSE)=0,\"\",VLOOKUP(A58,Financeiro[[id_ação_Fonte_oculta]:[R$  Executado (2027)]],5,FALSE))","v":4342000},{"$f":"IF(VLOOKUP(A58,Financeiro[[id_ação_Fonte_oculta]:[R$  Executado (2027)]],4,FALSE)=0,\"\",VLOOKUP(A58,Financeiro[[id_ação_Fonte_oculta]:[R$  Executado (2027)]],8,FALSE))","v":2300000},{"$f":"IF(VLOOKUP(A58,Financeiro[[id_ação_Fonte_oculta]:[R$  Executado (2027)]],4,FALSE)=0,\"\",VLOOKUP(A58,Financeiro[[id_ação_Fonte_oculta]:[R$  Executado (2027)]],11,FALSE))","v":0},{"$f":"IF(VLOOKUP(A58,Financeiro[[id_ação_Fonte_oculta]:[R$  Executado (2027)]],4,FALSE)=0,\"\",VLOOKUP(A58,Financeiro[[id_ação_Fonte_oculta]:[R$  Executado (2027)]],14,FALSE))","v":0},6642000,{"$f":"IFERROR(INDEX(IdentAcoes[SubPDC],MATCH(B58,IdentAcoes[ID Ação],0)),\"\")","v":"2.6 - Integração"},{"$f":"IFERROR(INDEX(IdentAcoes[Prioridade do PDC],MATCH(B58,IdentAcoes[ID Ação],0)),\"\")","v":"PDC 1 e 2"},{"$f":"IFERROR(INDEX(IdentAcoes[Segmento do executor],MATCH($B58,IdentAcoes[ID Ação],0)),\"\")","v":"Sociedade Civil"},{"$f":"IFERROR(INDEX(IdentAcoes[Área de abrangência],MATCH($B58,IdentAcoes[ID Ação],0)),\"\")","v":"Bacia"},{"$f":"IFERROR(INDEX(IdentAcoes[Detalhamento da área de abrangência],MATCH($B58,IdentAcoes[ID Ação],0)),\"\")","v":"Bacias PCJ"}]
["PCJ6.1.1.7/2024Cobrança Federal","PCJ6.1.1.7/2024",{"$f":"INDEX(Financeiro[Descrição da ação],MATCH(B59,Financeiro[ID Ação], 0))","v":"Apoio operacional para acompanhamento de ações da porção mineira"},{"$f":"IF(INDEX('Acompanhamento das metas 24-27'!$C$2:$C$100,MATCH(B59,'Acompanhamento das metas 24-27'!$A$2:$A$100,0))<>0,INDEX('Acompanhamento das metas 24-27'!$C$2:$C$100,MATCH(B59,'Acompanhamento das metas 24-27'!$A$2:$A$100,0)),\"\")","v":"Apoio operacional contínuo"},{"$f":"IF(VLOOKUP(A59,Financeiro[[id_ação_Fonte_oculta]:[R$  Executado (2027)]],4,FALSE)=0,\"\",VLOOKUP(A59,Financeiro[[id_ação_Fonte_oculta]:[R$  Executado (2027)]],4,FALSE))","v":"Cobrança Federal"},{"$f":"IF(VLOOKUP(A59,Financeiro[[id_ação_Fonte_oculta]:[R$  Executado (2027)]],4,FALSE)=0,\"\",VLOOKUP(A59,Financeiro[[id_ação_Fonte_oculta]:[R$  Executado (2027)]],5,FALSE))","v":385560},{"$f":"IF(VLOOKUP(A59,Financeiro[[id_ação_Fonte_oculta]:[R$  Executado (2027)]],4,FALSE)=0,\"\",VLOOKUP(A59,Financeiro[[id_ação_Fonte_oculta]:[R$  Executado (2027)]],8,FALSE))","v":385560},{"$f":"IF(VLOOKUP(A59,Financeiro[[id_ação_Fonte_oculta]:[R$  Executado (2027)]],4,FALSE)=0,\"\",VLOOKUP(A59,Financeiro[[id_ação_Fonte_oculta]:[R$  Executado (2027)]],11,FALSE))","v":0},{"$f":"IF(VLOOKUP(A59,Financeiro[[id_ação_Fonte_oculta]:[R$  Executado (2027)]],4,FALSE)=0,\"\",VLOOKUP(A59,Financeiro[[id_ação_Fonte_oculta]:[R$  Executado (2027)]],14,FALSE))","v":0},771120,{"$f":"IFERROR(INDEX(IdentAcoes[SubPDC],MATCH(B59,IdentAcoes[ID Ação],0)),\"\")","v":"2.6 - Integração"},{"$f":"IFERROR(INDEX(IdentAcoes[Prioridade do PDC],MATCH(B59,IdentAcoes[ID Ação],0)),\"\")","v":"PDC 1 e 2"},{"$f":"IFERROR(INDEX(IdentAcoes[Segmento do executor],MATCH($B59,IdentAcoes[ID Ação],0)),\"\")","v":"Sociedade Civil"},{"$f":"IFERROR(INDEX(IdentAcoes[Área de abrangência],MATCH($B59,IdentAcoes[ID Ação],0)),\"\")","v":"Bacia"},{"$f":"IFERROR(INDEX(IdentAcoes[Detalhamento da área de abrangência],MATCH($B59,IdentAcoes[ID Ação],0)),\"\")","v":"Bacias PCJ"}]
["PCJ6.1.1.1/2024Cobrança Federal","PCJ6.1.1.1/2024",{"$f":"INDEX(Financeiro[Descrição da ação],MATCH(B60,Financeiro[ID Ação], 0))","v":"Apoio operacional para a Área de Tecnologia da Informação - TI"},{"$f":"IF(INDEX('Acompanhamento das metas 24-27'!$C$2:$C$100,MATCH(B60,'Acompanhamento das metas 24-27'!$A$2:$A$100,0))<>0,INDEX('Acompanhamento das metas 24-27'!$C$2:$C$100,MATCH(B60,'Acompanhamento das metas 24-27'!$A$2:$A$100,0)),\"\")","v":"Apoio operacional contínuo"},{"$f":"IF(VLOOKUP(A60,Financeiro[[id_ação_Fonte_oculta]:[R$  Executado (2027)]],4,FALSE)=0,\"\",VLOOKUP(A60,Financeiro[[id_ação_Fonte_oculta]:[R$  Executado (2027)]],4,FALSE))","v":"Cobrança Federal"},{"$f":"IF(VLOOKUP(A60,Financeiro[[id_ação_Fonte_oculta]:[R$  Executado (2027)]],4,FALSE)=0,\"\",VLOOKUP(A60,Financeiro[[id_ação_Fonte_oculta]:[R$  Executado (2027)]],5,FALSE))","v":809312.42},{"$f":"IF(VLOOKUP(A60,Financeiro[[id_ação_Fonte_oculta]:[R$  Executado (2027)]],4,FALSE)=0,\"\",VLOOKUP(A60,Financeiro[[id_ação_Fonte_oculta]:[R$  Executado (2027)]],8,FALSE))","v":836019.72616293433},{"$f":"IF(VLOOKUP(A60,Financeiro[[id_ação_Fonte_oculta]:[R$  Executado (2027)]],4,FALSE)=0,\"\",VLOOKUP(A60,Financeiro[[id_ação_Fonte_oculta]:[R$  Executado (2027)]],11,FALSE))","v":0},{"$f":"IF(VLOOKUP(A60,Financeiro[[id_ação_Fonte_oculta]:[R$  Executado (2027)]],4,FALSE)=0,\"\",VLOOKUP(A60,Financeiro[[id_ação_Fonte_oculta]:[R$  Executado (2027)]],14,FALSE))","v":0},1645332.1461629344,{"$f":"IFERROR(INDEX(IdentAcoes[SubPDC],MATCH(B60,IdentAcoes[ID Ação],0)),\"\")","v":"2.6 - Integração"},{"$f":"IFERROR(INDEX(IdentAcoes[Prioridade do PDC],MATCH(B60,IdentAcoes[ID Ação],0)),\"\")","v":"PDC 1 e 2"},{"$f":"IFERROR(INDEX(IdentAcoes[Segmento do executor],MATCH($B60,IdentAcoes[ID Ação],0)),\"\")","v":"Sociedade Civil"},{"$f":"IFERROR(INDEX(IdentAcoes[Área de abrangência],MATCH($B60,IdentAcoes[ID Ação],0)),\"\")","v":"Bacia"},{"$f":"IFERROR(INDEX(IdentAcoes[Detalhamento da área de abrangência],MATCH($B60,IdentAcoes[ID Ação],0)),\"\")","v":"Bacias PCJ"}]
["PCJ6.1.2.4/2024Cobrança Federal","PCJ6.1.2.4/2024",{"$f":"INDEX(Financeiro[Descrição da ação],MATCH(B61,Financeiro[ID Ação], 0))","v":"Participação de membros dos Comitês PCJ em eventos internos das CTs e eventos externos"},{"$f":"IF(INDEX('Acompanhamento das metas 24-27'!$C$2:$C$100,MATCH(B61,'Acompanhamento das metas 24-27'!$A$2:$A$100,0))<>0,INDEX('Acompanhamento das metas 24-27'!$C$2:$C$100,MATCH(B61,'Acompanhamento das metas 24-27'!$A$2:$A$100,0)),\"\")","v":"Apoio operacional contínuo"},{"$f":"IF(VLOOKUP(A61,Financeiro[[id_ação_Fonte_oculta]:[R$  Executado (2027)]],4,FALSE)=0,\"\",VLOOKUP(A61,Financeiro[[id_ação_Fonte_oculta]:[R$  Executado (2027)]],4,FALSE))","v":"Cobrança Federal"},{"$f":"IF(VLOOKUP(A61,Financeiro[[id_ação_Fonte_oculta]:[R$  Executado (2027)]],4,FALSE)=0,\"\",VLOOKUP(A61,Financeiro[[id_ação_Fonte_oculta]:[R$  Executado (2027)]],5,FALSE))","v":326049.12},{"$f":"IF(VLOOKUP(A61,Financeiro[[id_ação_Fonte_oculta]:[R$  Executado (2027)]],4,FALSE)=0,\"\",VLOOKUP(A61,Financeiro[[id_ação_Fonte_oculta]:[R$  Executado (2027)]],8,FALSE))","v":336808.74096000008},{"$f":"IF(VLOOKUP(A61,Financeiro[[id_ação_Fonte_oculta]:[R$  Executado (2027)]],4,FALSE)=0,\"\",VLOOKUP(A61,Financeiro[[id_ação_Fonte_oculta]:[R$  Executado (2027)]],11,FALSE))","v":0},{"$f":"IF(VLOOKUP(A61,Financeiro[[id_ação_Fonte_oculta]:[R$  Executado (2027)]],4,FALSE)=0,\"\",VLOOKUP(A61,Financeiro[[id_ação_Fonte_oculta]:[R$  Executado (2027)]],14,FALSE))","v":0},662857.86096000008,{"$f":"IFERROR(INDEX(IdentAcoes[SubPDC],MATCH(B61,IdentAcoes[ID Ação],0)),\"\")","v":"2.6 - Integração"},{"$f":"IFERROR(INDEX(IdentAcoes[Prioridade do PDC],MATCH(B61,IdentAcoes[ID Ação],0)),\"\")","v":"PDC 1 e 2"},{"$f":"IFERROR(INDEX(IdentAcoes[Segmento do executor],MATCH($B61,IdentAcoes[ID Ação],0)),\"\")","v":"Sociedade Civil"},{"$f":"IFERROR(INDEX(IdentAcoes[Área de abrangência],MATCH($B61,IdentAcoes[ID Ação],0)),\"\")","v":"Bacia"},{"$f":"IFERROR(INDEX(IdentAcoes[Detalhamento da área de abrangência],MATCH($B61,IdentAcoes[ID Ação],0)),\"\")","v":"Bacias PCJ"}]
["PCJ6.1.2.5/2024Cobrança Federal","PCJ6.1.2.5/2024",{"$f":"INDEX(Financeiro[Descrição da ação],MATCH(B62,Financeiro[ID Ação], 0))","v":"Manutenção de licenciamento de sistemas de TI"},{"$f":"IF(INDEX('Acompanhamento das metas 24-27'!$C$2:$C$100,MATCH(B62,'Acompanhamento das metas 24-27'!$A$2:$A$100,0))<>0,INDEX('Acompanhamento das metas 24-27'!$C$2:$C$100,MATCH(B62,'Acompanhamento das metas 24-27'!$A$2:$A$100,0)),\"\")","v":"Apoio operacional contínuo"},{"$f":"IF(VLOOKUP(A62,Financeiro[[id_ação_Fonte_oculta]:[R$  Executado (2027)]],4,FALSE)=0,\"\",VLOOKUP(A62,Financeiro[[id_ação_Fonte_oculta]:[R$  Executado (2027)]],4,FALSE))","v":"Cobrança Federal"},{"$f":"IF(VLOOKUP(A62,Financeiro[[id_ação_Fonte_oculta]:[R$  Executado (2027)]],4,FALSE)=0,\"\",VLOOKUP(A62,Financeiro[[id_ação_Fonte_oculta]:[R$  Executado (2027)]],5,FALSE))","v":2178708},{"$f":"IF(VLOOKUP(A62,Financeiro[[id_ação_Fonte_oculta]:[R$  Executado (2027)]],4,FALSE)=0,\"\",VLOOKUP(A62,Financeiro[[id_ação_Fonte_oculta]:[R$  Executado (2027)]],8,FALSE))","v":2250605.3639999996},{"$f":"IF(VLOOKUP(A62,Financeiro[[id_ação_Fonte_oculta]:[R$  Executado (2027)]],4,FALSE)=0,\"\",VLOOKUP(A62,Financeiro[[id_ação_Fonte_oculta]:[R$  Executado (2027)]],11,FALSE))","v":0},{"$f":"IF(VLOOKUP(A62,Financeiro[[id_ação_Fonte_oculta]:[R$  Executado (2027)]],4,FALSE)=0,\"\",VLOOKUP(A62,Financeiro[[id_ação_Fonte_oculta]:[R$  Executado (2027)]],14,FALSE))","v":0},4429313.3640000001,{"$f":"IFERROR(INDEX(IdentAcoes[SubPDC],MATCH(B62,IdentAcoes[ID Ação],0)),\"\")","v":"2.7 - CORHI"},{"$f":"IFERROR(INDEX(IdentAcoes[Prioridade do PDC],MATCH(B62,IdentAcoes[ID Ação],0)),\"\")","v":"PDC 1 e 2"},{"$f":"IFERROR(INDEX(IdentAcoes[Segmento do executor],MATCH($B62,IdentAcoes[ID Ação],0)),\"\")","v":"Sociedade Civil"},{"$f":"IFERROR(INDEX(IdentAcoes[Área de abrangência],MATCH($B62,IdentAcoes[ID Ação],0)),\"\")","v":"Bacia"},{"$f":"IFERROR(INDEX(IdentAcoes[Detalhamento da área de abrangência],MATCH($B62,IdentAcoes[ID Ação],0)),\"\")","v":"Bacias PCJ"}]
["PCJ1.2.2.3/2024FEHIDRO - Cobrança estadual","PCJ1.2.2.3/2024",{"$f":"INDEX(Financeiro[Descrição da ação],MATCH(B63,Financeiro[ID Ação], 0))","v":"Implantação das tecnologias de desinfecção projetadas"},{"$f":"IF(INDEX('Acompanhamento das metas 24-27'!$C$2:$C$100,MATCH(B63,'Acompanhamento das metas 24-27'!$A$2:$A$100,0))<>0,INDEX('Acompanhamento das metas 24-27'!$C$2:$C$100,MATCH(B63,'Acompanhamento das metas 24-27'!$A$2:$A$100,0)),\"\")","v":"Ao menos 01 melhoria implantada"},{"$f":"IF(VLOOKUP(A63,Financeiro[[id_ação_Fonte_oculta]:[R$  Executado (2027)]],4,FALSE)=0,\"\",VLOOKUP(A63,Financeiro[[id_ação_Fonte_oculta]:[R$  Executado (2027)]],4,FALSE))","v":"FEHIDRO - Cobrança estadual"},{"$f":"IF(VLOOKUP(A63,Financeiro[[id_ação_Fonte_oculta]:[R$  Executado (2027)]],4,FALSE)=0,\"\",VLOOKUP(A63,Financeiro[[id_ação_Fonte_oculta]:[R$  Executado (2027)]],5,FALSE))","v":1500000},{"$f":"IF(VLOOKUP(A63,Financeiro[[id_ação_Fonte_oculta]:[R$  Executado (2027)]],4,FALSE)=0,\"\",VLOOKUP(A63,Financeiro[[id_ação_Fonte_oculta]:[R$  Executado (2027)]],8,FALSE))","v":750000},{"$f":"IF(VLOOKUP(A63,Financeiro[[id_ação_Fonte_oculta]:[R$  Executado (2027)]],4,FALSE)=0,\"\",VLOOKUP(A63,Financeiro[[id_ação_Fonte_oculta]:[R$  Executado (2027)]],11,FALSE))","v":750000},{"$f":"IF(VLOOKUP(A63,Financeiro[[id_ação_Fonte_oculta]:[R$  Executado (2027)]],4,FALSE)=0,\"\",VLOOKUP(A63,Financeiro[[id_ação_Fonte_oculta]:[R$  Executado (2027)]],14,FALSE))","v":750000},3750000,{"$f":"IFERROR(INDEX(IdentAcoes[SubPDC],MATCH(B63,IdentAcoes[ID Ação],0)),\"\")","v":"3.1 - Efluentes"},{"$f":"IFERROR(INDEX(IdentAcoes[Prioridade do PDC],MATCH(B63,IdentAcoes[ID Ação],0)),\"\")","v":"Prioritário"},{"$f":"IFERROR(INDEX(IdentAcoes[Segmento do executor],MATCH($B63,IdentAcoes[ID Ação],0)),\"\")","v":"Município"},{"$f":"IFERROR(INDEX(IdentAcoes[Área de abrangência],MATCH($B63,IdentAcoes[ID Ação],0)),\"\")","v":"Município"},{"$f":"IFERROR(INDEX(IdentAcoes[Detalhamento da área de abrangência],MATCH($B63,IdentAcoes[ID Ação],0)),\"\")","v":"Municípios observando as prioridades para coliformes termotolerantes no Plano de Bacias"}]
["PCJ1.1.2.5/2024FEHIDRO - Cobrança estadual","PCJ1.1.2.5/2024",{"$f":"INDEX(Financeiro[Descrição da ação],MATCH(B64,Financeiro[ID Ação], 0))","v":"Implantação das ETEs projetadas e melhorias das ETEs existentes"},{"$f":"IF(INDEX('Acompanhamento das metas 24-27'!$C$2:$C$100,MATCH(B64,'Acompanhamento das metas 24-27'!$A$2:$A$100,0))<>0,INDEX('Acompanhamento das metas 24-27'!$C$2:$C$100,MATCH(B64,'Acompanhamento das metas 24-27'!$A$2:$A$100,0)),\"\")","v":"Ao menos 01  ETE implantada"},{"$f":"IF(VLOOKUP(A64,Financeiro[[id_ação_Fonte_oculta]:[R$  Executado (2027)]],4,FALSE)=0,\"\",VLOOKUP(A64,Financeiro[[id_ação_Fonte_oculta]:[R$  Executado (2027)]],4,FALSE))","v":"FEHIDRO - Cobrança estadual"},{"$f":"IF(VLOOKUP(A64,Financeiro[[id_ação_Fonte_oculta]:[R$  Executado (2027)]],4,FALSE)=0,\"\",VLOOKUP(A64,Financeiro[[id_ação_Fonte_oculta]:[R$  Executado (2027)]],5,FALSE))","v":3000000},{"$f":"IF(VLOOKUP(A64,Financeiro[[id_ação_Fonte_oculta]:[R$  Executado (2027)]],4,FALSE)=0,\"\",VLOOKUP(A64,Financeiro[[id_ação_Fonte_oculta]:[R$  Executado (2027)]],8,FALSE))","v":1500000},{"$f":"IF(VLOOKUP(A64,Financeiro[[id_ação_Fonte_oculta]:[R$  Executado (2027)]],4,FALSE)=0,\"\",VLOOKUP(A64,Financeiro[[id_ação_Fonte_oculta]:[R$  Executado (2027)]],11,FALSE))","v":1000000},{"$f":"IF(VLOOKUP(A64,Financeiro[[id_ação_Fonte_oculta]:[R$  Executado (2027)]],4,FALSE)=0,\"\",VLOOKUP(A64,Financeiro[[id_ação_Fonte_oculta]:[R$  Executado (2027)]],14,FALSE))","v":1500000},7000000,{"$f":"IFERROR(INDEX(IdentAcoes[SubPDC],MATCH(B64,IdentAcoes[ID Ação],0)),\"\")","v":"3.1 - Efluentes"},{"$f":"IFERROR(INDEX(IdentAcoes[Prioridade do PDC],MATCH(B64,IdentAcoes[ID Ação],0)),\"\")","v":"Prioritário"},{"$f":"IFERROR(INDEX(IdentAcoes[Segmento do executor],MATCH($B64,IdentAcoes[ID Ação],0)),\"\")","v":"Município"},{"$f":"IFERROR(INDEX(IdentAcoes[Área de abrangência],MATCH($B64,IdentAcoes[ID Ação],0)),\"\")","v":"Município"},{"$f":"IFERROR(INDEX(IdentAcoes[Detalhamento da área de abrangência],MATCH($B64,IdentAcoes[ID Ação],0)),\"\")","v":"Municípios observando as prioridades para tratamento  no Plano de Bacias"}]
["PCJ1.2.1.9/2024FEHIDRO - Cobrança estadual","PCJ1.2.1.9/2024",{"$f":"INDEX(Financeiro[Descrição da ação],MATCH(B65,Financeiro[ID Ação], 0))","v":"Implantação das melhorias das ETEs projetadas e retrofit de ETEs para remoção de nutrientes"},{"$f":"IF(INDEX('Acompanhamento das metas 24-27'!$C$2:$C$100,MATCH(B65,'Acompanhamento das metas 24-27'!$A$2:$A$100,0))<>0,INDEX('Acompanhamento das metas 24-27'!$C$2:$C$100,MATCH(B65,'Acompanhamento das metas 24-27'!$A$2:$A$100,0)),\"\")","v":"Ao menos 01 melhoria implantada"},{"$f":"IF(VLOOKUP(A65,Financeiro[[id_ação_Fonte_oculta]:[R$  Executado (2027)]],4,FALSE)=0,\"\",VLOOKUP(A65,Financeiro[[id_ação_Fonte_oculta]:[R$  Executado (2027)]],4,FALSE))","v":"FEHIDRO - Cobrança estadual"},{"$f":"IF(VLOOKUP(A65,Financeiro[[id_ação_Fonte_oculta]:[R$  Executado (2027)]],4,FALSE)=0,\"\",VLOOKUP(A65,Financeiro[[id_ação_Fonte_oculta]:[R$  Executado (2027)]],5,FALSE))","v":3000000},{"$f":"IF(VLOOKUP(A65,Financeiro[[id_ação_Fonte_oculta]:[R$  Executado (2027)]],4,FALSE)=0,\"\",VLOOKUP(A65,Financeiro[[id_ação_Fonte_oculta]:[R$  Executado (2027)]],8,FALSE))","v":1500000},{"$f":"IF(VLOOKUP(A65,Financeiro[[id_ação_Fonte_oculta]:[R$  Executado (2027)]],4,FALSE)=0,\"\",VLOOKUP(A65,Financeiro[[id_ação_Fonte_oculta]:[R$  Executado (2027)]],11,FALSE))","v":1000000},{"$f":"IF(VLOOKUP(A65,Financeiro[[id_ação_Fonte_oculta]:[R$  Executado (2027)]],4,FALSE)=0,\"\",VLOOKUP(A65,Financeiro[[id_ação_Fonte_oculta]:[R$  Executado (2027)]],14,FALSE))","v":2000000},7500000,{"$f":"IFERROR(INDEX(IdentAcoes[SubPDC],MATCH(B65,IdentAcoes[ID Ação],0)),\"\")","v":"3.1 - Efluentes"},{"$f":"IFERROR(INDEX(IdentAcoes[Prioridade do PDC],MATCH(B65,IdentAcoes[ID Ação],0)),\"\")","v":"Prioritário"},{"$f":"IFERROR(INDEX(IdentAcoes[Segmento do executor],MATCH($B65,IdentAcoes[ID Ação],0)),\"\")","v":"Município"},{"$f":"IFERROR(INDEX(IdentAcoes[Área de abrangência],MATCH($B65,IdentAcoes[ID Ação],0)),\"\")","v":"Município"},{"$f":"IFERROR(INDEX(IdentAcoes[Detalhamento da área de abrangência],MATCH($B65,IdentAcoes[ID Ação],0)),\"\")","v":"Municípios observando as prioridades para remoção de nitrogênio e fósforo, no Plano de Bacias"}]
["PCJ1.2.1.8/2024FEHIDRO - Cobrança estadual","PCJ1.2.1.8/2024",{"$f":"INDEX(Financeiro[Descrição da ação],MATCH(B66,Financeiro[ID Ação], 0))","v":"Implantação de Unidades de Tratamento de Lodo nas ETAs"},{"$f":"IF(INDEX('Acompanhamento das metas 24-27'!$C$2:$C$100,MATCH(B66,'Acompanhamento das metas 24-27'!$A$2:$A$100,0))<>0,INDEX('Acompanhamento das metas 24-27'!$C$2:$C$100,MATCH(B66,'Acompanhamento das metas 24-27'!$A$2:$A$100,0)),\"\")","v":"Ao menos 01 UTLs implantada em ETA"},{"$f":"IF(VLOOKUP(A66,Financeiro[[id_ação_Fonte_oculta]:[R$  Executado (2027)]],4,FALSE)=0,\"\",VLOOKUP(A66,Financeiro[[id_ação_Fonte_oculta]:[R$  Executado (2027)]],4,FALSE))","v":"FEHIDRO - Cobrança estadual"},{"$f":"IF(VLOOKUP(A66,Financeiro[[id_ação_Fonte_oculta]:[R$  Executado (2027)]],4,FALSE)=0,\"\",VLOOKUP(A66,Financeiro[[id_ação_Fonte_oculta]:[R$  Executado (2027)]],5,FALSE))","v":2300000},{"$f":"IF(VLOOKUP(A66,Financeiro[[id_ação_Fonte_oculta]:[R$  Executado (2027)]],4,FALSE)=0,\"\",VLOOKUP(A66,Financeiro[[id_ação_Fonte_oculta]:[R$  Executado (2027)]],8,FALSE))","v":1000000},{"$f":"IF(VLOOKUP(A66,Financeiro[[id_ação_Fonte_oculta]:[R$  Executado (2027)]],4,FALSE)=0,\"\",VLOOKUP(A66,Financeiro[[id_ação_Fonte_oculta]:[R$  Executado (2027)]],11,FALSE))","v":0},{"$f":"IF(VLOOKUP(A66,Financeiro[[id_ação_Fonte_oculta]:[R$  Executado (2027)]],4,FALSE)=0,\"\",VLOOKUP(A66,Financeiro[[id_ação_Fonte_oculta]:[R$  Executado (2027)]],14,FALSE))","v":0},3300000,{"$f":"IFERROR(INDEX(IdentAcoes[SubPDC],MATCH(B66,IdentAcoes[ID Ação],0)),\"\")","v":"3.1 - Efluentes"},{"$f":"IFERROR(INDEX(IdentAcoes[Prioridade do PDC],MATCH(B66,IdentAcoes[ID Ação],0)),\"\")","v":"Prioritário"},{"$f":"IFERROR(INDEX(IdentAcoes[Segmento do executor],MATCH($B66,IdentAcoes[ID Ação],0)),\"\")","v":"Município"},{"$f":"IFERROR(INDEX(IdentAcoes[Área de abrangência],MATCH($B66,IdentAcoes[ID Ação],0)),\"\")","v":"Município"},{"$f":"IFERROR(INDEX(IdentAcoes[Detalhamento da área de abrangência],MATCH($B66,IdentAcoes[ID Ação],0)),\"\")","v":"Municípios observando as prioridades para tratamento  no Plano de Bacias"}]
["PCJ1.1.1.3/2024Outras fontes","PCJ1.1.1.3/2024",{"$f":"INDEX(Financeiro[Descrição da ação],MATCH(B67,Financeiro[ID Ação], 0))","v":"Elaboração de projetos de ampliação e melhoria dos sistemas de coleta de esgotos"},{"$f":"IF(INDEX('Acompanhamento das metas 24-27'!$C$2:$C$100,MATCH(B67,'Acompanhamento das metas 24-27'!$A$2:$A$100,0))<>0,INDEX('Acompanhamento das metas 24-27'!$C$2:$C$100,MATCH(B67,'Acompanhamento das metas 24-27'!$A$2:$A$100,0)),\"\")","v":"Elaboração de ao menos 01 projeto"},{"$f":"IF(VLOOKUP(A67,Financeiro[[id_ação_Fonte_oculta]:[R$  Executado (2027)]],4,FALSE)=0,\"\",VLOOKUP(A67,Financeiro[[id_ação_Fonte_oculta]:[R$  Executado (2027)]],4,FALSE))","v":"Outras fontes"},{"$f":"IF(VLOOKUP(A67,Financeiro[[id_ação_Fonte_oculta]:[R$  Executado (2027)]],4,FALSE)=0,\"\",VLOOKUP(A67,Financeiro[[id_ação_Fonte_oculta]:[R$  Executado (2027)]],5,FALSE))","v":0},{"$f":"IF(VLOOKUP(A67,Financeiro[[id_ação_Fonte_oculta]:[R$  Executado (2027)]],4,FALSE)=0,\"\",VLOOKUP(A67,Financeiro[[id_ação_Fonte_oculta]:[R$  Executado (2027)]],8,FALSE))","v":0},{"$f":"IF(VLOOKUP(A67,Financeiro[[id_ação_Fonte_oculta]:[R$  Executado (2027)]],4,FALSE)=0,\"\",VLOOKUP(A67,Financeiro[[id_ação_Fonte_oculta]:[R$  Executado (2027)]],11,FALSE))","v":0},{"$f":"IF(VLOOKUP(A67,Financeiro[[id_ação_Fonte_oculta]:[R$  Executado (2027)]],4,FALSE)=0,\"\",VLOOKUP(A67,Financeiro[[id_ação_Fonte_oculta]:[R$  Executado (2027)]],14,FALSE))","v":0},0,{"$f":"IFERROR(INDEX(IdentAcoes[SubPDC],MATCH(B67,IdentAcoes[ID Ação],0)),\"\")","v":"3.1 - Efluentes"},{"$f":"IFERROR(INDEX(IdentAcoes[Prioridade do PDC],MATCH(B67,IdentAcoes[ID Ação],0)),\"\")","v":"Prioritário"},{"$f":"IFERROR(INDEX(IdentAcoes[Segmento do executor],MATCH($B67,IdentAcoes[ID Ação],0)),\"\")","v":"Município"},{"$f":"IFERROR(INDEX(IdentAcoes[Área de abrangência],MATCH($B67,IdentAcoes[ID Ação],0)),\"\")","v":"Município"},{"$f":"IFERROR(INDEX(IdentAcoes[Detalhamento da área de abrangência],MATCH($B67,IdentAcoes[ID Ação],0)),\"\")","v":"Municípios observando as prioridades para tratamento  no Plano de Bacias"}]
["PCJ1.1.1.5/2024FEHIDRO - Cobrança estadual","PCJ1.1.1.5/2024",{"$f":"INDEX(Financeiro[Descrição da ação],MATCH(B68,Financeiro[ID Ação], 0))","v":"Ampliações e melhoria dos sistemas de coleta de esgotos"},{"$f":"IF(INDEX('Acompanhamento das metas 24-27'!$C$2:$C$100,MATCH(B68,'Acompanhamento das metas 24-27'!$A$2:$A$100,0))<>0,INDEX('Acompanhamento das metas 24-27'!$C$2:$C$100,MATCH(B68,'Acompanhamento das metas 24-27'!$A$2:$A$100,0)),\"\")","v":"Ampliação dos sistemas de coleta de esgotos de pelo menos 20% dos municípios prioritários"},{"$f":"IF(VLOOKUP(A68,Financeiro[[id_ação_Fonte_oculta]:[R$  Executado (2027)]],4,FALSE)=0,\"\",VLOOKUP(A68,Financeiro[[id_ação_Fonte_oculta]:[R$  Executado (2027)]],4,FALSE))","v":"FEHIDRO - Cobrança estadual"},{"$f":"IF(VLOOKUP(A68,Financeiro[[id_ação_Fonte_oculta]:[R$  Executado (2027)]],4,FALSE)=0,\"\",VLOOKUP(A68,Financeiro[[id_ação_Fonte_oculta]:[R$  Executado (2027)]],5,FALSE))","v":2500000},{"$f":"IF(VLOOKUP(A68,Financeiro[[id_ação_Fonte_oculta]:[R$  Executado (2027)]],4,FALSE)=0,\"\",VLOOKUP(A68,Financeiro[[id_ação_Fonte_oculta]:[R$  Executado (2027)]],8,FALSE))","v":1000000},{"$f":"IF(VLOOKUP(A68,Financeiro[[id_ação_Fonte_oculta]:[R$  Executado (2027)]],4,FALSE)=0,\"\",VLOOKUP(A68,Financeiro[[id_ação_Fonte_oculta]:[R$  Executado (2027)]],11,FALSE))","v":0},{"$f":"IF(VLOOKUP(A68,Financeiro[[id_ação_Fonte_oculta]:[R$  Executado (2027)]],4,FALSE)=0,\"\",VLOOKUP(A68,Financeiro[[id_ação_Fonte_oculta]:[R$  Executado (2027)]],14,FALSE))","v":0},{"$f":"SUM(F68:I68)","v":3500000},{"$f":"IFERROR(INDEX(IdentAcoes[SubPDC],MATCH(B68,IdentAcoes[ID Ação],0)),\"\")","v":"3.1 - Efluentes"},{"$f":"IFERROR(INDEX(IdentAcoes[Prioridade do PDC],MATCH(B68,IdentAcoes[ID Ação],0)),\"\")","v":"Prioritário"},{"$f":"IFERROR(INDEX(IdentAcoes[Segmento do executor],MATCH($B68,IdentAcoes[ID Ação],0)),\"\")","v":"Município"},{"$f":"IFERROR(INDEX(IdentAcoes[Área de abrangência],MATCH($B68,IdentAcoes[ID Ação],0)),\"\")","v":"Município"},{"$f":"IFERROR(INDEX(IdentAcoes[Detalhamento da área de abrangência],MATCH($B68,IdentAcoes[ID Ação],0)),\"\")","v":"Municípios com prioridades para coleta, no Plano de Bacias"}]
["PCJ1.3.2.1/2024Outras fontes","PCJ1.3.2.1/2024",{"$f":"INDEX(Financeiro[Descrição da ação],MATCH(B69,Financeiro[ID Ação], 0))","v":"Elaboração de projetos demonstrativos para contenção de cargas difusas de origem rural e urbana"},{"$f":"IF(INDEX('Acompanhamento das metas 24-27'!$C$2:$C$100,MATCH(B69,'Acompanhamento das metas 24-27'!$A$2:$A$100,0))<>0,INDEX('Acompanhamento das metas 24-27'!$C$2:$C$100,MATCH(B69,'Acompanhamento das metas 24-27'!$A$2:$A$100,0)),\"\")","v":"Estudo elaborado até final de 2025"},{"$f":"IF(VLOOKUP(A69,Financeiro[[id_ação_Fonte_oculta]:[R$  Executado (2027)]],4,FALSE)=0,\"\",VLOOKUP(A69,Financeiro[[id_ação_Fonte_oculta]:[R$  Executado (2027)]],4,FALSE))","v":"Outras fontes"},{"$f":"IF(VLOOKUP(A69,Financeiro[[id_ação_Fonte_oculta]:[R$  Executado (2027)]],4,FALSE)=0,\"\",VLOOKUP(A69,Financeiro[[id_ação_Fonte_oculta]:[R$  Executado (2027)]],5,FALSE))","v":0},{"$f":"IF(VLOOKUP(A69,Financeiro[[id_ação_Fonte_oculta]:[R$  Executado (2027)]],4,FALSE)=0,\"\",VLOOKUP(A69,Financeiro[[id_ação_Fonte_oculta]:[R$  Executado (2027)]],8,FALSE))","v":0},{"$f":"IF(VLOOKUP(A69,Financeiro[[id_ação_Fonte_oculta]:[R$  Executado (2027)]],4,FALSE)=0,\"\",VLOOKUP(A69,Financeiro[[id_ação_Fonte_oculta]:[R$  Executado (2027)]],11,FALSE))","v":0},{"$f":"IF(VLOOKUP(A69,Financeiro[[id_ação_Fonte_oculta]:[R$  Executado (2027)]],4,FALSE)=0,\"\",VLOOKUP(A69,Financeiro[[id_ação_Fonte_oculta]:[R$  Executado (2027)]],14,FALSE))","v":0},0,{"$f":"IFERROR(INDEX(IdentAcoes[SubPDC],MATCH(B69,IdentAcoes[ID Ação],0)),\"\")","v":"3.2 - Poluição"},{"$f":"IFERROR(INDEX(IdentAcoes[Prioridade do PDC],MATCH(B69,IdentAcoes[ID Ação],0)),\"\")","v":"Prioritário"},{"$f":"IFERROR(INDEX(IdentAcoes[Segmento do executor],MATCH($B69,IdentAcoes[ID Ação],0)),\"\")","v":"Sociedade Civil"},{"$f":"IFERROR(INDEX(IdentAcoes[Área de abrangência],MATCH($B69,IdentAcoes[ID Ação],0)),\"\")","v":"Bacia"},{"$f":"IFERROR(INDEX(IdentAcoes[Detalhamento da área de abrangência],MATCH($B69,IdentAcoes[ID Ação],0)),\"\")","v":"Bacias PCJ, observando as prioridades para fósforo e nitrogênio."}]
["PCJ1.3.2.3/2024Outras fontes","PCJ1.3.2.3/2024",{"$f":"INDEX(Financeiro[Descrição da ação],MATCH(B70,Financeiro[ID Ação], 0))","v":"Implantação de medidas de contenção de cargas difusas de origem rural e urbana em locais prioritários"},{"$f":"IF(INDEX('Acompanhamento das metas 24-27'!$C$2:$C$100,MATCH(B70,'Acompanhamento das metas 24-27'!$A$2:$A$100,0))<>0,INDEX('Acompanhamento das metas 24-27'!$C$2:$C$100,MATCH(B70,'Acompanhamento das metas 24-27'!$A$2:$A$100,0)),\"\")","v":"Todos os locais prioritários contemplados com as medidas propostas de mitigação da poluição difusa de maneira contínua até o fim de 2035"},{"$f":"IF(VLOOKUP(A70,Financeiro[[id_ação_Fonte_oculta]:[R$  Executado (2027)]],4,FALSE)=0,\"\",VLOOKUP(A70,Financeiro[[id_ação_Fonte_oculta]:[R$  Executado (2027)]],4,FALSE))","v":"Outras fontes"},{"$f":"IF(VLOOKUP(A70,Financeiro[[id_ação_Fonte_oculta]:[R$  Executado (2027)]],4,FALSE)=0,\"\",VLOOKUP(A70,Financeiro[[id_ação_Fonte_oculta]:[R$  Executado (2027)]],5,FALSE))","v":0},{"$f":"IF(VLOOKUP(A70,Financeiro[[id_ação_Fonte_oculta]:[R$  Executado (2027)]],4,FALSE)=0,\"\",VLOOKUP(A70,Financeiro[[id_ação_Fonte_oculta]:[R$  Executado (2027)]],8,FALSE))","v":0},{"$f":"IF(VLOOKUP(A70,Financeiro[[id_ação_Fonte_oculta]:[R$  Executado (2027)]],4,FALSE)=0,\"\",VLOOKUP(A70,Financeiro[[id_ação_Fonte_oculta]:[R$  Executado (2027)]],11,FALSE))","v":0},{"$f":"IF(VLOOKUP(A70,Financeiro[[id_ação_Fonte_oculta]:[R$  Executado (2027)]],4,FALSE)=0,\"\",VLOOKUP(A70,Financeiro[[id_ação_Fonte_oculta]:[R$  Executado (2027)]],14,FALSE))","v":0},0,{"$f":"IFERROR(INDEX(IdentAcoes[SubPDC],MATCH(B70,IdentAcoes[ID Ação],0)),\"\")","v":"3.2 - Poluição"},{"$f":"IFERROR(INDEX(IdentAcoes[Prioridade do PDC],MATCH(B70,IdentAcoes[ID Ação],0)),\"\")","v":"Prioritário"},{"$f":"IFERROR(INDEX(IdentAcoes[Segmento do executor],MATCH($B70,IdentAcoes[ID Ação],0)),\"\")","v":"Município"},{"$f":"IFERROR(INDEX(IdentAcoes[Área de abrangência],MATCH($B70,IdentAcoes[ID Ação],0)),\"\")","v":"Bacia"},{"$f":"IFERROR(INDEX(IdentAcoes[Detalhamento da área de abrangência],MATCH($B70,IdentAcoes[ID Ação],0)),\"\")","v":"Bacias PCJ observando as prioridades para fósforo e nitrogênio"}]
["PCJ3.1.2.5/2024Cobrança Federal","PCJ3.1.2.5/2024",{"$f":"INDEX(Financeiro[Descrição da ação],MATCH(B71,Financeiro[ID Ação], 0))","v":"Estabilização de voçorocas nas propriedades que receberão projetos de recomposição florestal (fonte: PDRF)"},{"$f":"IF(INDEX('Acompanhamento das metas 24-27'!$C$2:$C$100,MATCH(B71,'Acompanhamento das metas 24-27'!$A$2:$A$100,0))<>0,INDEX('Acompanhamento das metas 24-27'!$C$2:$C$100,MATCH(B71,'Acompanhamento das metas 24-27'!$A$2:$A$100,0)),\"\")","v":"Estabilização de ao menos 10 voçorocas/ano nas propriedades que recebem projetos de recomposição florestal"},{"$f":"IF(VLOOKUP(A71,Financeiro[[id_ação_Fonte_oculta]:[R$  Executado (2027)]],4,FALSE)=0,\"\",VLOOKUP(A71,Financeiro[[id_ação_Fonte_oculta]:[R$  Executado (2027)]],4,FALSE))","v":"Cobrança Federal"},{"$f":"IF(VLOOKUP(A71,Financeiro[[id_ação_Fonte_oculta]:[R$  Executado (2027)]],4,FALSE)=0,\"\",VLOOKUP(A71,Financeiro[[id_ação_Fonte_oculta]:[R$  Executado (2027)]],5,FALSE))","v":0},{"$f":"IF(VLOOKUP(A71,Financeiro[[id_ação_Fonte_oculta]:[R$  Executado (2027)]],4,FALSE)=0,\"\",VLOOKUP(A71,Financeiro[[id_ação_Fonte_oculta]:[R$  Executado (2027)]],8,FALSE))","v":0},{"$f":"IF(VLOOKUP(A71,Financeiro[[id_ação_Fonte_oculta]:[R$  Executado (2027)]],4,FALSE)=0,\"\",VLOOKUP(A71,Financeiro[[id_ação_Fonte_oculta]:[R$  Executado (2027)]],11,FALSE))","v":0},{"$f":"IF(VLOOKUP(A71,Financeiro[[id_ação_Fonte_oculta]:[R$  Executado (2027)]],4,FALSE)=0,\"\",VLOOKUP(A71,Financeiro[[id_ação_Fonte_oculta]:[R$  Executado (2027)]],14,FALSE))","v":0},0,{"$f":"IFERROR(INDEX(IdentAcoes[SubPDC],MATCH(B71,IdentAcoes[ID Ação],0)),\"\")","v":"4.1 - Controle erosão"},{"$f":"IFERROR(INDEX(IdentAcoes[Prioridade do PDC],MATCH(B71,IdentAcoes[ID Ação],0)),\"\")","v":"Não prioritário"},{"$f":"IFERROR(INDEX(IdentAcoes[Segmento do executor],MATCH($B71,IdentAcoes[ID Ação],0)),\"\")","v":"Sociedade Civil"},{"$f":"IFERROR(INDEX(IdentAcoes[Área de abrangência],MATCH($B71,IdentAcoes[ID Ação],0)),\"\")","v":"Bacia"},{"$f":"IFERROR(INDEX(IdentAcoes[Detalhamento da área de abrangência],MATCH($B71,IdentAcoes[ID Ação],0)),\"\")","v":"Áreas de Contribuição das Bacias PCJ prioritárias conforme mapa síntese Mapa Conservação, recuperação de nascentes, matas ciliares e áreas de recarga do Plano  de Bacias"}]
["PCJ6.1.1.3/2024Cobrança Federal","PCJ6.1.1.3/2024",{"$f":"INDEX(Financeiro[Descrição da ação],MATCH(B72,Financeiro[ID Ação], 0))","v":"Apoio operacional para acompanhamento de projetos de assessoria ambiental"},{"$f":"IF(INDEX('Acompanhamento das metas 24-27'!$C$2:$C$100,MATCH(B72,'Acompanhamento das metas 24-27'!$A$2:$A$100,0))<>0,INDEX('Acompanhamento das metas 24-27'!$C$2:$C$100,MATCH(B72,'Acompanhamento das metas 24-27'!$A$2:$A$100,0)),\"\")","v":"Apoio operacional contínuo"},{"$f":"IF(VLOOKUP(A72,Financeiro[[id_ação_Fonte_oculta]:[R$  Executado (2027)]],4,FALSE)=0,\"\",VLOOKUP(A72,Financeiro[[id_ação_Fonte_oculta]:[R$  Executado (2027)]],4,FALSE))","v":"Cobrança Federal"},{"$f":"IF(VLOOKUP(A72,Financeiro[[id_ação_Fonte_oculta]:[R$  Executado (2027)]],4,FALSE)=0,\"\",VLOOKUP(A72,Financeiro[[id_ação_Fonte_oculta]:[R$  Executado (2027)]],5,FALSE))","v":2100000},{"$f":"IF(VLOOKUP(A72,Financeiro[[id_ação_Fonte_oculta]:[R$  Executado (2027)]],4,FALSE)=0,\"\",VLOOKUP(A72,Financeiro[[id_ação_Fonte_oculta]:[R$  Executado (2027)]],8,FALSE))","v":2100000},{"$f":"IF(VLOOKUP(A72,Financeiro[[id_ação_Fonte_oculta]:[R$  Executado (2027)]],4,FALSE)=0,\"\",VLOOKUP(A72,Financeiro[[id_ação_Fonte_oculta]:[R$  Executado (2027)]],11,FALSE))","v":0},{"$f":"IF(VLOOKUP(A72,Financeiro[[id_ação_Fonte_oculta]:[R$  Executado (2027)]],4,FALSE)=0,\"\",VLOOKUP(A72,Financeiro[[id_ação_Fonte_oculta]:[R$  Executado (2027)]],14,FALSE))","v":0},4200000,{"$f":"IFERROR(INDEX(IdentAcoes[SubPDC],MATCH(B72,IdentAcoes[ID Ação],0)),\"\")","v":"4.2 - Soluções baseadas Natureza"},{"$f":"IFERROR(INDEX(IdentAcoes[Prioridade do PDC],MATCH(B72,IdentAcoes[ID Ação],0)),\"\")","v":"Não prioritário"},{"$f":"IFERROR(INDEX(IdentAcoes[Segmento do executor],MATCH($B72,IdentAcoes[ID Ação],0)),\"\")","v":"Sociedade Civil"},{"$f":"IFERROR(INDEX(IdentAcoes[Área de abrangência],MATCH($B72,IdentAcoes[ID Ação],0)),\"\")","v":"Bacia"},{"$f":"IFERROR(INDEX(IdentAcoes[Detalhamento da área de abrangência],MATCH($B72,IdentAcoes[ID Ação],0)),\"\")","v":"Áreas de Contribuição das Bacias PCJ prioritárias conforme mapa síntese Mapa Conservação, recuperação de nascentes, matas ciliares e áreas de recarga do Plano  de Bacias"}]
["PCJ3.1.2.1/2024Cobrança Federal","PCJ3.1.2.1/2024",{"$f":"INDEX(Financeiro[Descrição da ação],MATCH(B73,Financeiro[ID Ação], 0))","v":"Promoção da conservação e recuperação de nascentes, matas ciliares e áreas de recarga"},{"$f":"IF(INDEX('Acompanhamento das metas 24-27'!$C$2:$C$100,MATCH(B73,'Acompanhamento das metas 24-27'!$A$2:$A$100,0))<>0,INDEX('Acompanhamento das metas 24-27'!$C$2:$C$100,MATCH(B73,'Acompanhamento das metas 24-27'!$A$2:$A$100,0)),\"\")","v":"Recuperação de 40 hectares de áreas prioritárias por ano"},{"$f":"IF(VLOOKUP(A73,Financeiro[[id_ação_Fonte_oculta]:[R$  Executado (2027)]],4,FALSE)=0,\"\",VLOOKUP(A73,Financeiro[[id_ação_Fonte_oculta]:[R$  Executado (2027)]],4,FALSE))","v":"Cobrança Federal"},{"$f":"IF(VLOOKUP(A73,Financeiro[[id_ação_Fonte_oculta]:[R$  Executado (2027)]],4,FALSE)=0,\"\",VLOOKUP(A73,Financeiro[[id_ação_Fonte_oculta]:[R$  Executado (2027)]],5,FALSE))","v":500000},{"$f":"IF(VLOOKUP(A73,Financeiro[[id_ação_Fonte_oculta]:[R$  Executado (2027)]],4,FALSE)=0,\"\",VLOOKUP(A73,Financeiro[[id_ação_Fonte_oculta]:[R$  Executado (2027)]],8,FALSE))","v":500000},{"$f":"IF(VLOOKUP(A73,Financeiro[[id_ação_Fonte_oculta]:[R$  Executado (2027)]],4,FALSE)=0,\"\",VLOOKUP(A73,Financeiro[[id_ação_Fonte_oculta]:[R$  Executado (2027)]],11,FALSE))","v":0},{"$f":"IF(VLOOKUP(A73,Financeiro[[id_ação_Fonte_oculta]:[R$  Executado (2027)]],4,FALSE)=0,\"\",VLOOKUP(A73,Financeiro[[id_ação_Fonte_oculta]:[R$  Executado (2027)]],14,FALSE))","v":0},1000000,{"$f":"IFERROR(INDEX(IdentAcoes[SubPDC],MATCH(B73,IdentAcoes[ID Ação],0)),\"\")","v":"4.2 - Soluções baseadas Natureza"},{"$f":"IFERROR(INDEX(IdentAcoes[Prioridade do PDC],MATCH(B73,IdentAcoes[ID Ação],0)),\"\")","v":"Não prioritário"},{"$f":"IFERROR(INDEX(IdentAcoes[Segmento do executor],MATCH($B73,IdentAcoes[ID Ação],0)),\"\")","v":"Sociedade Civil"},{"$f":"IFERROR(INDEX(IdentAcoes[Área de abrangência],MATCH($B73,IdentAcoes[ID Ação],0)),\"\")","v":"Bacia"},{"$f":"IFERROR(INDEX(IdentAcoes[Detalhamento da área de abrangência],MATCH($B73,IdentAcoes[ID Ação],0)),\"\")","v":"Áreas de Contribuição das Bacias PCJ prioritárias conforme mapa síntese Mapa Conservação, recuperação de nascentes, matas ciliares e áreas de recarga do Plano  de Bacias"}]
["PCJ3.1.3.1/2024Cobrança Federal","PCJ3.1.3.1/2024",{"$f":"INDEX(Financeiro[Descrição da ação],MATCH(B74,Financeiro[ID Ação], 0))","v":"Implementação de projetos de PSA"},{"$f":"IF(INDEX('Acompanhamento das metas 24-27'!$C$2:$C$100,MATCH(B74,'Acompanhamento das metas 24-27'!$A$2:$A$100,0))<>0,INDEX('Acompanhamento das metas 24-27'!$C$2:$C$100,MATCH(B74,'Acompanhamento das metas 24-27'!$A$2:$A$100,0)),\"\")","v":"Contratação de ao menos 01 projeto aprovado no Edital anualmente"},{"$f":"IF(VLOOKUP(A74,Financeiro[[id_ação_Fonte_oculta]:[R$  Executado (2027)]],4,FALSE)=0,\"\",VLOOKUP(A74,Financeiro[[id_ação_Fonte_oculta]:[R$  Executado (2027)]],4,FALSE))","v":"Cobrança Federal"},{"$f":"IF(VLOOKUP(A74,Financeiro[[id_ação_Fonte_oculta]:[R$  Executado (2027)]],4,FALSE)=0,\"\",VLOOKUP(A74,Financeiro[[id_ação_Fonte_oculta]:[R$  Executado (2027)]],5,FALSE))","v":0},{"$f":"IF(VLOOKUP(A74,Financeiro[[id_ação_Fonte_oculta]:[R$  Executado (2027)]],4,FALSE)=0,\"\",VLOOKUP(A74,Financeiro[[id_ação_Fonte_oculta]:[R$  Executado (2027)]],8,FALSE))","v":0},{"$f":"IF(VLOOKUP(A74,Financeiro[[id_ação_Fonte_oculta]:[R$  Executado (2027)]],4,FALSE)=0,\"\",VLOOKUP(A74,Financeiro[[id_ação_Fonte_oculta]:[R$  Executado (2027)]],11,FALSE))","v":0},{"$f":"IF(VLOOKUP(A74,Financeiro[[id_ação_Fonte_oculta]:[R$  Executado (2027)]],4,FALSE)=0,\"\",VLOOKUP(A74,Financeiro[[id_ação_Fonte_oculta]:[R$  Executado (2027)]],14,FALSE))","v":0},0,{"$f":"IFERROR(INDEX(IdentAcoes[SubPDC],MATCH(B74,IdentAcoes[ID Ação],0)),\"\")","v":"4.2 - Soluções baseadas Natureza"},{"$f":"IFERROR(INDEX(IdentAcoes[Prioridade do PDC],MATCH(B74,IdentAcoes[ID Ação],0)),\"\")","v":"Não prioritário"},{"$f":"IFERROR(INDEX(IdentAcoes[Segmento do executor],MATCH($B74,IdentAcoes[ID Ação],0)),\"\")","v":"Sociedade Civil"},{"$f":"IFERROR(INDEX(IdentAcoes[Área de abrangência],MATCH($B74,IdentAcoes[ID Ação],0)),\"\")","v":"Bacia"},{"$f":"IFERROR(INDEX(IdentAcoes[Detalhamento da área de abrangência],MATCH($B74,IdentAcoes[ID Ação],0)),\"\")","v":"Áreas de Contribuição das Bacias PCJ prioritárias conforme mapa síntese Mapa Conservação, recuperação de nascentes, matas ciliares e áreas de recarga do Plano  de Bacias"}]
["PCJ3.1.1.1/2024Cobrança Federal","PCJ3.1.1.1/2024",{"$f":"INDEX(Financeiro[Descrição da ação],MATCH(B75,Financeiro[ID Ação], 0))","v":"Desenvolvimento e monitoramento da implementação dos PIPs"},{"$f":"IF(INDEX('Acompanhamento das metas 24-27'!$C$2:$C$100,MATCH(B75,'Acompanhamento das metas 24-27'!$A$2:$A$100,0))<>0,INDEX('Acompanhamento das metas 24-27'!$C$2:$C$100,MATCH(B75,'Acompanhamento das metas 24-27'!$A$2:$A$100,0)),\"\")","v":"Contratação da elaboração de PIPs para 1.000 hectares por ano"},{"$f":"IF(VLOOKUP(A75,Financeiro[[id_ação_Fonte_oculta]:[R$  Executado (2027)]],4,FALSE)=0,\"\",VLOOKUP(A75,Financeiro[[id_ação_Fonte_oculta]:[R$  Executado (2027)]],4,FALSE))","v":"Cobrança Federal"},{"$f":"IF(VLOOKUP(A75,Financeiro[[id_ação_Fonte_oculta]:[R$  Executado (2027)]],4,FALSE)=0,\"\",VLOOKUP(A75,Financeiro[[id_ação_Fonte_oculta]:[R$  Executado (2027)]],5,FALSE))","v":600000},{"$f":"IF(VLOOKUP(A75,Financeiro[[id_ação_Fonte_oculta]:[R$  Executado (2027)]],4,FALSE)=0,\"\",VLOOKUP(A75,Financeiro[[id_ação_Fonte_oculta]:[R$  Executado (2027)]],8,FALSE))","v":600000},{"$f":"IF(VLOOKUP(A75,Financeiro[[id_ação_Fonte_oculta]:[R$  Executado (2027)]],4,FALSE)=0,\"\",VLOOKUP(A75,Financeiro[[id_ação_Fonte_oculta]:[R$  Executado (2027)]],11,FALSE))","v":0},{"$f":"IF(VLOOKUP(A75,Financeiro[[id_ação_Fonte_oculta]:[R$  Executado (2027)]],4,FALSE)=0,\"\",VLOOKUP(A75,Financeiro[[id_ação_Fonte_oculta]:[R$  Executado (2027)]],14,FALSE))","v":0},1200000,{"$f":"IFERROR(INDEX(IdentAcoes[SubPDC],MATCH(B75,IdentAcoes[ID Ação],0)),\"\")","v":"4.3 - Mananciais"},{"$f":"IFERROR(INDEX(IdentAcoes[Prioridade do PDC],MATCH(B75,IdentAcoes[ID Ação],0)),\"\")","v":"Não prioritário"},{"$f":"IFERROR(INDEX(IdentAcoes[Segmento do executor],MATCH($B75,IdentAcoes[ID Ação],0)),\"\")","v":"Sociedade Civil"},{"$f":"IFERROR(INDEX(IdentAcoes[Área de abrangência],MATCH($B75,IdentAcoes[ID Ação],0)),\"\")","v":"Bacia"},{"$f":"IFERROR(INDEX(IdentAcoes[Detalhamento da área de abrangência],MATCH($B75,IdentAcoes[ID Ação],0)),\"\")","v":"Bacias PCJ"}]
["PCJ5.3.1.2/2024Cobrança Federal","PCJ5.3.1.2/2024",{"$f":"INDEX(Financeiro[Descrição da ação],MATCH(B76,Financeiro[ID Ação], 0))","v":"Elaboração de um Plano de Capacitação Técnica e realização de processos formativos nas áreas de atuação das Câmaras Técnicas"},{"$f":"IF(INDEX('Acompanhamento das metas 24-27'!$C$2:$C$100,MATCH(B76,'Acompanhamento das metas 24-27'!$A$2:$A$100,0))<>0,INDEX('Acompanhamento das metas 24-27'!$C$2:$C$100,MATCH(B76,'Acompanhamento das metas 24-27'!$A$2:$A$100,0)),\"\")","v":"01 Plano elaborado e ao menos 12 membros capacitados em nível de pós-graduação"},{"$f":"IF(VLOOKUP(A76,Financeiro[[id_ação_Fonte_oculta]:[R$  Executado (2027)]],4,FALSE)=0,\"\",VLOOKUP(A76,Financeiro[[id_ação_Fonte_oculta]:[R$  Executado (2027)]],4,FALSE))","v":"Cobrança Federal"},{"$f":"IF(VLOOKUP(A76,Financeiro[[id_ação_Fonte_oculta]:[R$  Executado (2027)]],4,FALSE)=0,\"\",VLOOKUP(A76,Financeiro[[id_ação_Fonte_oculta]:[R$  Executado (2027)]],5,FALSE))","v":191079.13},{"$f":"IF(VLOOKUP(A76,Financeiro[[id_ação_Fonte_oculta]:[R$  Executado (2027)]],4,FALSE)=0,\"\",VLOOKUP(A76,Financeiro[[id_ação_Fonte_oculta]:[R$  Executado (2027)]],8,FALSE))","v":197384.74178716226},{"$f":"IF(VLOOKUP(A76,Financeiro[[id_ação_Fonte_oculta]:[R$  Executado (2027)]],4,FALSE)=0,\"\",VLOOKUP(A76,Financeiro[[id_ação_Fonte_oculta]:[R$  Executado (2027)]],11,FALSE))","v":0},{"$f":"IF(VLOOKUP(A76,Financeiro[[id_ação_Fonte_oculta]:[R$  Executado (2027)]],4,FALSE)=0,\"\",VLOOKUP(A76,Financeiro[[id_ação_Fonte_oculta]:[R$  Executado (2027)]],14,FALSE))","v":0},388463.87178716226,{"$f":"IFERROR(INDEX(IdentAcoes[SubPDC],MATCH(B76,IdentAcoes[ID Ação],0)),\"\")","v":"8.1 - Capacitação"},{"$f":"IFERROR(INDEX(IdentAcoes[Prioridade do PDC],MATCH(B76,IdentAcoes[ID Ação],0)),\"\")","v":"Não prioritário"},{"$f":"IFERROR(INDEX(IdentAcoes[Segmento do executor],MATCH($B76,IdentAcoes[ID Ação],0)),\"\")","v":"Sociedade Civil"},{"$f":"IFERROR(INDEX(IdentAcoes[Área de abrangência],MATCH($B76,IdentAcoes[ID Ação],0)),\"\")","v":"Bacia"},{"$f":"IFERROR(INDEX(IdentAcoes[Detalhamento da área de abrangência],MATCH($B76,IdentAcoes[ID Ação],0)),\"\")","v":"Bacias PCJ"}]
["PCJ1.4.1.2/2024Cobrança Federal","PCJ1.4.1.2/2024",{"$f":"INDEX(Financeiro[Descrição da ação],MATCH(B77,Financeiro[ID Ação], 0))","v":"Ampliação e divulgação do programa de capacitação (Escola da Água e Saneamento), fomento e incentivo à capacitação de operadores"},{"$f":"IF(INDEX('Acompanhamento das metas 24-27'!$C$2:$C$100,MATCH(B77,'Acompanhamento das metas 24-27'!$A$2:$A$100,0))<>0,INDEX('Acompanhamento das metas 24-27'!$C$2:$C$100,MATCH(B77,'Acompanhamento das metas 24-27'!$A$2:$A$100,0)),\"\")","v":"Capacitação de ao menos 05 turmas por ano"},{"$f":"IF(VLOOKUP(A77,Financeiro[[id_ação_Fonte_oculta]:[R$  Executado (2027)]],4,FALSE)=0,\"\",VLOOKUP(A77,Financeiro[[id_ação_Fonte_oculta]:[R$  Executado (2027)]],4,FALSE))","v":"Cobrança Federal"},{"$f":"IF(VLOOKUP(A77,Financeiro[[id_ação_Fonte_oculta]:[R$  Executado (2027)]],4,FALSE)=0,\"\",VLOOKUP(A77,Financeiro[[id_ação_Fonte_oculta]:[R$  Executado (2027)]],5,FALSE))","v":75000},{"$f":"IF(VLOOKUP(A77,Financeiro[[id_ação_Fonte_oculta]:[R$  Executado (2027)]],4,FALSE)=0,\"\",VLOOKUP(A77,Financeiro[[id_ação_Fonte_oculta]:[R$  Executado (2027)]],8,FALSE))","v":75000},{"$f":"IF(VLOOKUP(A77,Financeiro[[id_ação_Fonte_oculta]:[R$  Executado (2027)]],4,FALSE)=0,\"\",VLOOKUP(A77,Financeiro[[id_ação_Fonte_oculta]:[R$  Executado (2027)]],11,FALSE))","v":0},{"$f":"IF(VLOOKUP(A77,Financeiro[[id_ação_Fonte_oculta]:[R$  Executado (2027)]],4,FALSE)=0,\"\",VLOOKUP(A77,Financeiro[[id_ação_Fonte_oculta]:[R$  Executado (2027)]],14,FALSE))","v":0},150000,{"$f":"IFERROR(INDEX(IdentAcoes[SubPDC],MATCH(B77,IdentAcoes[ID Ação],0)),\"\")","v":"8.1 - Capacitação"},{"$f":"IFERROR(INDEX(IdentAcoes[Prioridade do PDC],MATCH(B77,IdentAcoes[ID Ação],0)),\"\")","v":"Não prioritário"},{"$f":"IFERROR(INDEX(IdentAcoes[Segmento do executor],MATCH($B77,IdentAcoes[ID Ação],0)),\"\")","v":"Sociedade Civil"},{"$f":"IFERROR(INDEX(IdentAcoes[Área de abrangência],MATCH($B77,IdentAcoes[ID Ação],0)),\"\")","v":"Bacia"},{"$f":"IFERROR(INDEX(IdentAcoes[Detalhamento da área de abrangência],MATCH($B77,IdentAcoes[ID Ação],0)),\"\")","v":"Bacias PCJ"}]
["PCJ5.2.1.2/2024Cobrança Federal","PCJ5.2.1.2/2024",{"$f":"INDEX(Financeiro[Descrição da ação],MATCH(B78,Financeiro[ID Ação], 0))","v":"Realização de processos formativos e campanhas educativas sobre a realidade das Bacias PCJ"},{"$f":"IF(INDEX('Acompanhamento das metas 24-27'!$C$2:$C$100,MATCH(B78,'Acompanhamento das metas 24-27'!$A$2:$A$100,0))<>0,INDEX('Acompanhamento das metas 24-27'!$C$2:$C$100,MATCH(B78,'Acompanhamento das metas 24-27'!$A$2:$A$100,0)),\"\")","v":"Ao menos 01 processo formativo e uma campanha educativa realizada"},{"$f":"IF(VLOOKUP(A78,Financeiro[[id_ação_Fonte_oculta]:[R$  Executado (2027)]],4,FALSE)=0,\"\",VLOOKUP(A78,Financeiro[[id_ação_Fonte_oculta]:[R$  Executado (2027)]],4,FALSE))","v":"Cobrança Federal"},{"$f":"IF(VLOOKUP(A78,Financeiro[[id_ação_Fonte_oculta]:[R$  Executado (2027)]],4,FALSE)=0,\"\",VLOOKUP(A78,Financeiro[[id_ação_Fonte_oculta]:[R$  Executado (2027)]],5,FALSE))","v":1000000},{"$f":"IF(VLOOKUP(A78,Financeiro[[id_ação_Fonte_oculta]:[R$  Executado (2027)]],4,FALSE)=0,\"\",VLOOKUP(A78,Financeiro[[id_ação_Fonte_oculta]:[R$  Executado (2027)]],8,FALSE))","v":750000},{"$f":"IF(VLOOKUP(A78,Financeiro[[id_ação_Fonte_oculta]:[R$  Executado (2027)]],4,FALSE)=0,\"\",VLOOKUP(A78,Financeiro[[id_ação_Fonte_oculta]:[R$  Executado (2027)]],11,FALSE))","v":0},{"$f":"IF(VLOOKUP(A78,Financeiro[[id_ação_Fonte_oculta]:[R$  Executado (2027)]],4,FALSE)=0,\"\",VLOOKUP(A78,Financeiro[[id_ação_Fonte_oculta]:[R$  Executado (2027)]],14,FALSE))","v":0},1750000,{"$f":"IFERROR(INDEX(IdentAcoes[SubPDC],MATCH(B78,IdentAcoes[ID Ação],0)),\"\")","v":"8.2 - Educação"},{"$f":"IFERROR(INDEX(IdentAcoes[Prioridade do PDC],MATCH(B78,IdentAcoes[ID Ação],0)),\"\")","v":"Não prioritário"},{"$f":"IFERROR(INDEX(IdentAcoes[Segmento do executor],MATCH($B78,IdentAcoes[ID Ação],0)),\"\")","v":"Sociedade Civil"},{"$f":"IFERROR(INDEX(IdentAcoes[Área de abrangência],MATCH($B78,IdentAcoes[ID Ação],0)),\"\")","v":"Bacia"},{"$f":"IFERROR(INDEX(IdentAcoes[Detalhamento da área de abrangência],MATCH($B78,IdentAcoes[ID Ação],0)),\"\")","v":"Bacias PCJ"}]
["PCJ5.1.1.1/2024Cobrança Federal","PCJ5.1.1.1/2024",{"$f":"INDEX(Financeiro[Descrição da ação],MATCH(B79,Financeiro[ID Ação], 0))","v":"Elaboração e execução de um Plano de Comunicação para o fortalecimento da comunicação entre a sociedade civil e os Comitês PCJ"},{"$f":"IF(INDEX('Acompanhamento das metas 24-27'!$C$2:$C$100,MATCH(B79,'Acompanhamento das metas 24-27'!$A$2:$A$100,0))<>0,INDEX('Acompanhamento das metas 24-27'!$C$2:$C$100,MATCH(B79,'Acompanhamento das metas 24-27'!$A$2:$A$100,0)),\"\")","v":"01 Plano elaborado e ações implementadas"},{"$f":"IF(VLOOKUP(A79,Financeiro[[id_ação_Fonte_oculta]:[R$  Executado (2027)]],4,FALSE)=0,\"\",VLOOKUP(A79,Financeiro[[id_ação_Fonte_oculta]:[R$  Executado (2027)]],4,FALSE))","v":"Cobrança Federal"},{"$f":"IF(VLOOKUP(A79,Financeiro[[id_ação_Fonte_oculta]:[R$  Executado (2027)]],4,FALSE)=0,\"\",VLOOKUP(A79,Financeiro[[id_ação_Fonte_oculta]:[R$  Executado (2027)]],5,FALSE))","v":750000},{"$f":"IF(VLOOKUP(A79,Financeiro[[id_ação_Fonte_oculta]:[R$  Executado (2027)]],4,FALSE)=0,\"\",VLOOKUP(A79,Financeiro[[id_ação_Fonte_oculta]:[R$  Executado (2027)]],8,FALSE))","v":750000},{"$f":"IF(VLOOKUP(A79,Financeiro[[id_ação_Fonte_oculta]:[R$  Executado (2027)]],4,FALSE)=0,\"\",VLOOKUP(A79,Financeiro[[id_ação_Fonte_oculta]:[R$  Executado (2027)]],11,FALSE))","v":0},{"$f":"IF(VLOOKUP(A79,Financeiro[[id_ação_Fonte_oculta]:[R$  Executado (2027)]],4,FALSE)=0,\"\",VLOOKUP(A79,Financeiro[[id_ação_Fonte_oculta]:[R$  Executado (2027)]],14,FALSE))","v":0},1500000,{"$f":"IFERROR(INDEX(IdentAcoes[SubPDC],MATCH(B79,IdentAcoes[ID Ação],0)),\"\")","v":"8.3 - Comunicação"},{"$f":"IFERROR(INDEX(IdentAcoes[Prioridade do PDC],MATCH(B79,IdentAcoes[ID Ação],0)),\"\")","v":"Não prioritário"},{"$f":"IFERROR(INDEX(IdentAcoes[Segmento do executor],MATCH($B79,IdentAcoes[ID Ação],0)),\"\")","v":"Sociedade Civil"},{"$f":"IFERROR(INDEX(IdentAcoes[Área de abrangência],MATCH($B79,IdentAcoes[ID Ação],0)),\"\")","v":"Bacia"},{"$f":"IFERROR(INDEX(IdentAcoes[Detalhamento da área de abrangência],MATCH($B79,IdentAcoes[ID Ação],0)),\"\")","v":"Bacias PCJ"}]
["PCJ6.1.1.6/2024Cobrança Federal","PCJ6.1.1.6/2024",{"$f":"INDEX(Financeiro[Descrição da ação],MATCH(B80,Financeiro[ID Ação], 0))","v":"Apoio operacional para a área de comunicação social"},{"$f":"IF(INDEX('Acompanhamento das metas 24-27'!$C$2:$C$100,MATCH(B80,'Acompanhamento das metas 24-27'!$A$2:$A$100,0))<>0,INDEX('Acompanhamento das metas 24-27'!$C$2:$C$100,MATCH(B80,'Acompanhamento das metas 24-27'!$A$2:$A$100,0)),\"\")","v":"Apoio operacional contínuo"},{"$f":"IF(VLOOKUP(A80,Financeiro[[id_ação_Fonte_oculta]:[R$  Executado (2027)]],4,FALSE)=0,\"\",VLOOKUP(A80,Financeiro[[id_ação_Fonte_oculta]:[R$  Executado (2027)]],4,FALSE))","v":"Cobrança Federal"},{"$f":"IF(VLOOKUP(A80,Financeiro[[id_ação_Fonte_oculta]:[R$  Executado (2027)]],4,FALSE)=0,\"\",VLOOKUP(A80,Financeiro[[id_ação_Fonte_oculta]:[R$  Executado (2027)]],5,FALSE))","v":375902.03},{"$f":"IF(VLOOKUP(A80,Financeiro[[id_ação_Fonte_oculta]:[R$  Executado (2027)]],4,FALSE)=0,\"\",VLOOKUP(A80,Financeiro[[id_ação_Fonte_oculta]:[R$  Executado (2027)]],8,FALSE))","v":388306.79745278403},{"$f":"IF(VLOOKUP(A80,Financeiro[[id_ação_Fonte_oculta]:[R$  Executado (2027)]],4,FALSE)=0,\"\",VLOOKUP(A80,Financeiro[[id_ação_Fonte_oculta]:[R$  Executado (2027)]],11,FALSE))","v":0},{"$f":"IF(VLOOKUP(A80,Financeiro[[id_ação_Fonte_oculta]:[R$  Executado (2027)]],4,FALSE)=0,\"\",VLOOKUP(A80,Financeiro[[id_ação_Fonte_oculta]:[R$  Executado (2027)]],14,FALSE))","v":0},764208.82745278405,{"$f":"IFERROR(INDEX(IdentAcoes[SubPDC],MATCH(B80,IdentAcoes[ID Ação],0)),\"\")","v":"8.3 - Comunicação"},{"$f":"IFERROR(INDEX(IdentAcoes[Prioridade do PDC],MATCH(B80,IdentAcoes[ID Ação],0)),\"\")","v":"Não prioritário"},{"$f":"IFERROR(INDEX(IdentAcoes[Segmento do executor],MATCH($B80,IdentAcoes[ID Ação],0)),\"\")","v":"Sociedade Civil"},{"$f":"IFERROR(INDEX(IdentAcoes[Área de abrangência],MATCH($B80,IdentAcoes[ID Ação],0)),\"\")","v":"Bacia"},{"$f":"IFERROR(INDEX(IdentAcoes[Detalhamento da área de abrangência],MATCH($B80,IdentAcoes[ID Ação],0)),\"\")","v":"Bacias PCJ"}]
["PCJ5.2.1.3/2024Cobrança Federal","PCJ5.2.1.3/2024",{"$f":"INDEX(Financeiro[Descrição da ação],MATCH(B81,Financeiro[ID Ação], 0))","v":"Elaboração e divulgação de materiais educativos"},{"$f":"IF(INDEX('Acompanhamento das metas 24-27'!$C$2:$C$100,MATCH(B81,'Acompanhamento das metas 24-27'!$A$2:$A$100,0))<>0,INDEX('Acompanhamento das metas 24-27'!$C$2:$C$100,MATCH(B81,'Acompanhamento das metas 24-27'!$A$2:$A$100,0)),\"\")","v":"Materiais educativos elaborados e distribuídos, conforme planejado pelo plano de comunicação."},{"$f":"IF(VLOOKUP(A81,Financeiro[[id_ação_Fonte_oculta]:[R$  Executado (2027)]],4,FALSE)=0,\"\",VLOOKUP(A81,Financeiro[[id_ação_Fonte_oculta]:[R$  Executado (2027)]],4,FALSE))","v":"Cobrança Federal"},{"$f":"IF(VLOOKUP(A81,Financeiro[[id_ação_Fonte_oculta]:[R$  Executado (2027)]],4,FALSE)=0,\"\",VLOOKUP(A81,Financeiro[[id_ação_Fonte_oculta]:[R$  Executado (2027)]],5,FALSE))","v":500000},{"$f":"IF(VLOOKUP(A81,Financeiro[[id_ação_Fonte_oculta]:[R$  Executado (2027)]],4,FALSE)=0,\"\",VLOOKUP(A81,Financeiro[[id_ação_Fonte_oculta]:[R$  Executado (2027)]],8,FALSE))","v":500000},{"$f":"IF(VLOOKUP(A81,Financeiro[[id_ação_Fonte_oculta]:[R$  Executado (2027)]],4,FALSE)=0,\"\",VLOOKUP(A81,Financeiro[[id_ação_Fonte_oculta]:[R$  Executado (2027)]],11,FALSE))","v":0},{"$f":"IF(VLOOKUP(A81,Financeiro[[id_ação_Fonte_oculta]:[R$  Executado (2027)]],4,FALSE)=0,\"\",VLOOKUP(A81,Financeiro[[id_ação_Fonte_oculta]:[R$  Executado (2027)]],14,FALSE))","v":0},1000000,{"$f":"IFERROR(INDEX(IdentAcoes[SubPDC],MATCH(B81,IdentAcoes[ID Ação],0)),\"\")","v":"8.3 - Comunicação"},{"$f":"IFERROR(INDEX(IdentAcoes[Prioridade do PDC],MATCH(B81,IdentAcoes[ID Ação],0)),\"\")","v":"Não prioritário"},{"$f":"IFERROR(INDEX(IdentAcoes[Segmento do executor],MATCH($B81,IdentAcoes[ID Ação],0)),\"\")","v":"Sociedade Civil"},{"$f":"IFERROR(INDEX(IdentAcoes[Área de abrangência],MATCH($B81,IdentAcoes[ID Ação],0)),\"\")","v":"Bacia"},{"$f":"IFERROR(INDEX(IdentAcoes[Detalhamento da área de abrangência],MATCH($B81,IdentAcoes[ID Ação],0)),\"\")","v":"Bacias PCJ"}]
["",""]
["",""]
["",""]
["",""]
["",""]
["",""]
["",""]
["",""]
["",""]
["",""]
["",""]
["",""]
["",""]
["",""]
["",""]
["",""]
["",""]
["",""]
["",""]
["",""]

{"sheet":"Consolidaçao - 1","index":5,"n_rows":38,"n_cols":19,"rows_kept":38,"cut":false,"hidden":true,"merged":[]}
["Delib. 190",null,"2021 (R$ Estimado)",null,null,null,null,"Delib. 246","2022 (R$ Estimado)",null,null,null,null,"2023 (R$ Estimado)",null,null,null,null,"2022 - 2023  (R$ Estimado)"]
["SubPDC","CFURH","Cobrança Estadual","Cobrança Federal","Outras","TOTAL",null,"SubPDC","CFURH","Cobrança Estadual","Cobrança Federal","Outras","TOTAL","CFURH","Cobrança Estadual","Cobrança Federal","Outras","TOTAL","TOTAL"]
["1.1 - SI",{"$f":"SUMIFS(#REF!,#REF!,A3,#REF!,2021)","v":{"$error":"#REF!"}},{"$f":"SUMIFS(#REF!,#REF!,A3,#REF!,2021)","v":{"$error":"#REF!"}},{"$f":"SUMIFS(#REF!,#REF!,A3,#REF!,2021)","v":{"$error":"#REF!"}},{"$f":"SUMIFS(#REF!,#REF!,A3,#REF!,2021)","v":{"$error":"#REF!"}},{"$f":"SUM(B3:E3)","v":{"$error":"#REF!"}},null,"1.1 - Legislação",{"$f":"SUMIFS(PAPI20_22_23[Recurso financeiro estimado no ano (R$) - CFURH],PAPI20_22_23[SubPDC],'Consolidaçao - 1'!H3,PAPI20_22_23[Ano previsto para início],2022)","v":0},{"$f":"SUMIFS(PAPI20_22_23[Recurso financeiro estimado no ano\n(R$) - Cobrança Estadual],PAPI20_22_23[SubPDC],'Consolidaçao - 1'!H3,PAPI20_22_23[Ano previsto para início],2022)","v":0},{"$f":"SUMIFS(PAPI20_22_23[Recurso financeiro estimado no ano\n(R$) - Cobrança Federal],PAPI20_22_23[SubPDC],'Consolidaçao - 1'!H3,PAPI20_22_23[Ano previsto para início],2022)","v":0},{"$f":"SUMIFS(PAPI20_22_23[Recurso financeiro estimado no ano (R$) - Outras],PAPI20_22_23[SubPDC],'Consolidaçao - 1'!H3,PAPI20_22_23[Ano previsto para início],2022)","v":0},{"$f":"SUM(I3:L3)","v":0},{"$f":"SUMIFS(PAPI20_22_23[Recurso financeiro estimado no ano (R$) - CFURH],PAPI20_22_23[SubPDC],'Consolidaçao - 1'!H3,PAPI20_22_23[Ano previsto para início],2023)","v":0},{"$f":"SUMIFS(PAPI20_22_23[Recurso financeiro estimado no ano\n(R$) - Cobrança Estadual],PAPI20_22_23[SubPDC],'Consolidaçao - 1'!M3,PAPI20_22_23[Ano previsto para início],2023)","v":0},{"$f":"SUMIFS(PAPI20_22_23[Recurso financeiro estimado no ano\n(R$) - Cobrança Federal],PAPI20_22_23[SubPDC],'Consolidaçao - 1'!M3,PAPI20_22_23[Ano previsto para início],2023)","v":0},{"$f":"SUMIFS(PAPI20_22_23[Recurso financeiro estimado no ano (R$) - Outras],PAPI20_22_23[SubPDC],'Consolidaçao - 1'!M3,PAPI20_22_23[Ano previsto para início],2023)","v":0},{"$f":"SUM(N3:Q3)","v":0},{"$f":"SUM(M3,R3)","v":0}]
["1.2 - Planejamento",{"$f":"SUMIFS(#REF!,#REF!,A4,#REF!,2021)","v":{"$error":"#REF!"}},{"$f":"SUMIFS(#REF!,#REF!,A4,#REF!,2021)","v":{"$error":"#REF!"}},{"$f":"SUMIFS(#REF!,#REF!,A4,#REF!,2021)","v":{"$error":"#REF!"}},{"$f":"SUMIFS(#REF!,#REF!,A4,#REF!,2021)","v":{"$error":"#REF!"}},{"$error":"#REF!"},null,"1.2 - Planejamento",{"$f":"SUMIFS(PAPI20_22_23[Recurso financeiro estimado no ano (R$) - CFURH],PAPI20_22_23[SubPDC],'Consolidaçao - 1'!H4,PAPI20_22_23[Ano previsto para início],2022)","v":0},{"$f":"SUMIFS(PAPI20_22_23[Recurso financeiro estimado no ano\n(R$) - Cobrança Estadual],PAPI20_22_23[SubPDC],'Consolidaçao - 1'!H4,PAPI20_22_23[Ano previsto para início],2022)","v":0},{"$f":"SUMIFS(PAPI20_22_23[Recurso financeiro estimado no ano\n(R$) - Cobrança Federal],PAPI20_22_23[SubPDC],'Consolidaçao - 1'!H4,PAPI20_22_23[Ano previsto para início],2022)","v":0},{"$f":"SUMIFS(PAPI20_22_23[Recurso financeiro estimado no ano (R$) - Outras],PAPI20_22_23[SubPDC],'Consolidaçao - 1'!H4,PAPI20_22_23[Ano previsto para início],2022)","v":0},0,{"$f":"SUMIFS(PAPI20_22_23[Recurso financeiro estimado no ano (R$) - CFURH],PAPI20_22_23[SubPDC],'Consolidaçao - 1'!H4,PAPI20_22_23[Ano previsto para início],2023)","v":0},{"$f":"SUMIFS(PAPI20_22_23[Recurso financeiro estimado no ano\n(R$) - Cobrança Estadual],PAPI20_22_23[SubPDC],'Consolidaçao - 1'!M4,PAPI20_22_23[Ano previsto para início],2023)","v":0},{"$f":"SUMIFS(PAPI20_22_23[Recurso financeiro estimado no ano\n(R$) - Cobrança Federal],PAPI20_22_23[SubPDC],'Consolidaçao - 1'!M4,PAPI20_22_23[Ano previsto para início],2023)","v":0},{"$f":"SUMIFS(PAPI20_22_23[Recurso financeiro estimado no ano (R$) - Outras],PAPI20_22_23[SubPDC],'Consolidaçao - 1'!M4,PAPI20_22_23[Ano previsto para início],2023)","v":0},0,{"$f":"SUM(M4,R4)","v":0}]
["1.3 - Enquadramento",{"$f":"SUMIFS(#REF!,#REF!,A5,#REF!,2021)","v":{"$error":"#REF!"}},{"$f":"SUMIFS(#REF!,#REF!,A5,#REF!,2021)","v":{"$error":"#REF!"}},{"$f":"SUMIFS(#REF!,#REF!,A5,#REF!,2021)","v":{"$error":"#REF!"}},{"$f":"SUMIFS(#REF!,#REF!,A5,#REF!,2021)","v":{"$error":"#REF!"}},{"$error":"#REF!"},null,"2.1 - Plano",{"$f":"SUMIFS(PAPI20_22_23[Recurso financeiro estimado no ano (R$) - CFURH],PAPI20_22_23[SubPDC],'Consolidaçao - 1'!H5,PAPI20_22_23[Ano previsto para início],2022)","v":0},{"$f":"SUMIFS(PAPI20_22_23[Recurso financeiro estimado no ano\n(R$) - Cobrança Estadual],PAPI20_22_23[SubPDC],'Consolidaçao - 1'!H5,PAPI20_22_23[Ano previsto para início],2022)","v":0},{"$f":"SUMIFS(PAPI20_22_23[Recurso financeiro estimado no ano\n(R$) - Cobrança Federal],PAPI20_22_23[SubPDC],'Consolidaçao - 1'!H5,PAPI20_22_23[Ano previsto para início],2022)","v":0},{"$f":"SUMIFS(PAPI20_22_23[Recurso financeiro estimado no ano (R$) - Outras],PAPI20_22_23[SubPDC],'Consolidaçao - 1'!H5,PAPI20_22_23[Ano previsto para início],2022)","v":0},0,{"$f":"SUMIFS(PAPI20_22_23[Recurso financeiro estimado no ano (R$) - CFURH],PAPI20_22_23[SubPDC],'Consolidaçao - 1'!H5,PAPI20_22_23[Ano previsto para início],2023)","v":0},{"$f":"SUMIFS(PAPI20_22_23[Recurso financeiro estimado no ano\n(R$) - Cobrança Estadual],PAPI20_22_23[SubPDC],'Consolidaçao - 1'!M5,PAPI20_22_23[Ano previsto para início],2023)","v":0},{"$f":"SUMIFS(PAPI20_22_23[Recurso financeiro estimado no ano\n(R$) - Cobrança Federal],PAPI20_22_23[SubPDC],'Consolidaçao - 1'!M5,PAPI20_22_23[Ano previsto para início],2023)","v":0},{"$f":"SUMIFS(PAPI20_22_23[Recurso financeiro estimado no ano (R$) - Outras],PAPI20_22_23[SubPDC],'Consolidaçao - 1'!M5,PAPI20_22_23[Ano previsto para início],2023)","v":0},0,0]
["1.4 - Monitoramento",{"$f":"SUMIFS(#REF!,#REF!,A6,#REF!,2021)","v":{"$error":"#REF!"}},{"$f":"SUMIFS(#REF!,#REF!,A6,#REF!,2021)","v":{"$error":"#REF!"}},{"$f":"SUMIFS(#REF!,#REF!,A6,#REF!,2021)","v":{"$error":"#REF!"}},{"$f":"SUMIFS(#REF!,#REF!,A6,#REF!,2021)","v":{"$error":"#REF!"}},{"$error":"#REF!"},null,"2.2 - Outorga",{"$f":"SUMIFS(PAPI20_22_23[Recurso financeiro estimado no ano (R$) - CFURH],PAPI20_22_23[SubPDC],'Consolidaçao - 1'!H6,PAPI20_22_23[Ano previsto para início],2022)","v":0},{"$f":"SUMIFS(PAPI20_22_23[Recurso financeiro estimado no ano\n(R$) - Cobrança Estadual],PAPI20_22_23[SubPDC],'Consolidaçao - 1'!H6,PAPI20_22_23[Ano previsto para início],2022)","v":0},{"$f":"SUMIFS(PAPI20_22_23[Recurso financeiro estimado no ano\n(R$) - Cobrança Federal],PAPI20_22_23[SubPDC],'Consolidaçao - 1'!H6,PAPI20_22_23[Ano previsto para início],2022)","v":0},{"$f":"SUMIFS(PAPI20_22_23[Recurso financeiro estimado no ano (R$) - Outras],PAPI20_22_23[SubPDC],'Consolidaçao - 1'!H6,PAPI20_22_23[Ano previsto para início],2022)","v":0},0,{"$f":"SUMIFS(PAPI20_22_23[Recurso financeiro estimado no ano (R$) - CFURH],PAPI20_22_23[SubPDC],'Consolidaçao - 1'!H6,PAPI20_22_23[Ano previsto para início],2023)","v":0},{"$f":"SUMIFS(PAPI20_22_23[Recurso financeiro estimado no ano\n(R$) - Cobrança Estadual],PAPI20_22_23[SubPDC],'Consolidaçao - 1'!M6,PAPI20_22_23[Ano previsto para início],2023)","v":0},{"$f":"SUMIFS(PAPI20_22_23[Recurso financeiro estimado no ano\n(R$) - Cobrança Federal],PAPI20_22_23[SubPDC],'Consolidaçao - 1'!M6,PAPI20_22_23[Ano previsto para início],2023)","v":0},{"$f":"SUMIFS(PAPI20_22_23[Recurso financeiro estimado no ano (R$) - Outras],PAPI20_22_23[SubPDC],'Consolidaçao - 1'!M6,PAPI20_22_23[Ano previsto para início],2023)","v":0},0,0]
["1.5 - Disponibilidade",{"$f":"SUMIFS(#REF!,#REF!,A7,#REF!,2021)","v":{"$error":"#REF!"}},{"$f":"SUMIFS(#REF!,#REF!,A7,#REF!,2021)","v":{"$error":"#REF!"}},{"$f":"SUMIFS(#REF!,#REF!,A7,#REF!,2021)","v":{"$error":"#REF!"}},{"$f":"SUMIFS(#REF!,#REF!,A7,#REF!,2021)","v":{"$error":"#REF!"}},{"$error":"#REF!"},null,"2.3 - Cobrança",{"$f":"SUMIFS(PAPI20_22_23[Recurso financeiro estimado no ano (R$) - CFURH],PAPI20_22_23[SubPDC],'Consolidaçao - 1'!H7,PAPI20_22_23[Ano previsto para início],2022)","v":0},{"$f":"SUMIFS(PAPI20_22_23[Recurso financeiro estimado no ano\n(R$) - Cobrança Estadual],PAPI20_22_23[SubPDC],'Consolidaçao - 1'!H7,PAPI20_22_23[Ano previsto para início],2022)","v":0},{"$f":"SUMIFS(PAPI20_22_23[Recurso financeiro estimado no ano\n(R$) - Cobrança Federal],PAPI20_22_23[SubPDC],'Consolidaçao - 1'!H7,PAPI20_22_23[Ano previsto para início],2022)","v":0},{"$f":"SUMIFS(PAPI20_22_23[Recurso financeiro estimado no ano (R$) - Outras],PAPI20_22_23[SubPDC],'Consolidaçao - 1'!H7,PAPI20_22_23[Ano previsto para início],2022)","v":0},0,{"$f":"SUMIFS(PAPI20_22_23[Recurso financeiro estimado no ano (R$) - CFURH],PAPI20_22_23[SubPDC],'Consolidaçao - 1'!H7,PAPI20_22_23[Ano previsto para início],2023)","v":0},{"$f":"SUMIFS(PAPI20_22_23[Recurso financeiro estimado no ano\n(R$) - Cobrança Estadual],PAPI20_22_23[SubPDC],'Consolidaçao - 1'!M7,PAPI20_22_23[Ano previsto para início],2023)","v":0},{"$f":"SUMIFS(PAPI20_22_23[Recurso financeiro estimado no ano\n(R$) - Cobrança Federal],PAPI20_22_23[SubPDC],'Consolidaçao - 1'!M7,PAPI20_22_23[Ano previsto para início],2023)","v":0},{"$f":"SUMIFS(PAPI20_22_23[Recurso financeiro estimado no ano (R$) - Outras],PAPI20_22_23[SubPDC],'Consolidaçao - 1'!M7,PAPI20_22_23[Ano previsto para início],2023)","v":0},0,0]
["1.6 - Legislação",{"$f":"SUMIFS(#REF!,#REF!,A8,#REF!,2021)","v":{"$error":"#REF!"}},{"$f":"SUMIFS(#REF!,#REF!,A8,#REF!,2021)","v":{"$error":"#REF!"}},{"$f":"SUMIFS(#REF!,#REF!,A8,#REF!,2021)","v":{"$error":"#REF!"}},{"$f":"SUMIFS(#REF!,#REF!,A8,#REF!,2021)","v":{"$error":"#REF!"}},{"$error":"#REF!"},null,"2.4 - Enquadramento",{"$f":"SUMIFS(PAPI20_22_23[Recurso financeiro estimado no ano (R$) - CFURH],PAPI20_22_23[SubPDC],'Consolidaçao - 1'!H8,PAPI20_22_23[Ano previsto para início],2022)","v":0},{"$f":"SUMIFS(PAPI20_22_23[Recurso financeiro estimado no ano\n(R$) - Cobrança Estadual],PAPI20_22_23[SubPDC],'Consolidaçao - 1'!H8,PAPI20_22_23[Ano previsto para início],2022)","v":0},{"$f":"SUMIFS(PAPI20_22_23[Recurso financeiro estimado no ano\n(R$) - Cobrança Federal],PAPI20_22_23[SubPDC],'Consolidaçao - 1'!H8,PAPI20_22_23[Ano previsto para início],2022)","v":0},{"$f":"SUMIFS(PAPI20_22_23[Recurso financeiro estimado no ano (R$) - Outras],PAPI20_22_23[SubPDC],'Consolidaçao - 1'!H8,PAPI20_22_23[Ano previsto para início],2022)","v":0},0,{"$f":"SUMIFS(PAPI20_22_23[Recurso financeiro estimado no ano (R$) - CFURH],PAPI20_22_23[SubPDC],'Consolidaçao - 1'!H8,PAPI20_22_23[Ano previsto para início],2023)","v":0},{"$f":"SUMIFS(PAPI20_22_23[Recurso financeiro estimado no ano\n(R$) - Cobrança Estadual],PAPI20_22_23[SubPDC],'Consolidaçao - 1'!M8,PAPI20_22_23[Ano previsto para início],2023)","v":0},{"$f":"SUMIFS(PAPI20_22_23[Recurso financeiro estimado no ano\n(R$) - Cobrança Federal],PAPI20_22_23[SubPDC],'Consolidaçao - 1'!M8,PAPI20_22_23[Ano previsto para início],2023)","v":0},{"$f":"SUMIFS(PAPI20_22_23[Recurso financeiro estimado no ano (R$) - Outras],PAPI20_22_23[SubPDC],'Consolidaçao - 1'!M8,PAPI20_22_23[Ano previsto para início],2023)","v":0},0,0]
["1.7 - Poluição",{"$f":"SUMIFS(#REF!,#REF!,A9,#REF!,2021)","v":{"$error":"#REF!"}},{"$f":"SUMIFS(#REF!,#REF!,A9,#REF!,2021)","v":{"$error":"#REF!"}},{"$f":"SUMIFS(#REF!,#REF!,A9,#REF!,2021)","v":{"$error":"#REF!"}},{"$f":"SUMIFS(#REF!,#REF!,A9,#REF!,2021)","v":{"$error":"#REF!"}},{"$error":"#REF!"},null,"2.5 - Monitoramento e SI",{"$f":"SUMIFS(PAPI20_22_23[Recurso financeiro estimado no ano (R$) - CFURH],PAPI20_22_23[SubPDC],'Consolidaçao - 1'!H9,PAPI20_22_23[Ano previsto para início],2022)","v":0},{"$f":"SUMIFS(PAPI20_22_23[Recurso financeiro estimado no ano\n(R$) - Cobrança Estadual],PAPI20_22_23[SubPDC],'Consolidaçao - 1'!H9,PAPI20_22_23[Ano previsto para início],2022)","v":0},{"$f":"SUMIFS(PAPI20_22_23[Recurso financeiro estimado no ano\n(R$) - Cobrança Federal],PAPI20_22_23[SubPDC],'Consolidaçao - 1'!H9,PAPI20_22_23[Ano previsto para início],2022)","v":0},{"$f":"SUMIFS(PAPI20_22_23[Recurso financeiro estimado no ano (R$) - Outras],PAPI20_22_23[SubPDC],'Consolidaçao - 1'!H9,PAPI20_22_23[Ano previsto para início],2022)","v":0},0,{"$f":"SUMIFS(PAPI20_22_23[Recurso financeiro estimado no ano (R$) - CFURH],PAPI20_22_23[SubPDC],'Consolidaçao - 1'!H9,PAPI20_22_23[Ano previsto para início],2023)","v":0},{"$f":"SUMIFS(PAPI20_22_23[Recurso financeiro estimado no ano\n(R$) - Cobrança Estadual],PAPI20_22_23[SubPDC],'Consolidaçao - 1'!M9,PAPI20_22_23[Ano previsto para início],2023)","v":0},{"$f":"SUMIFS(PAPI20_22_23[Recurso financeiro estimado no ano\n(R$) - Cobrança Federal],PAPI20_22_23[SubPDC],'Consolidaçao - 1'!M9,PAPI20_22_23[Ano previsto para início],2023)","v":0},{"$f":"SUMIFS(PAPI20_22_23[Recurso financeiro estimado no ano (R$) - Outras],PAPI20_22_23[SubPDC],'Consolidaçao - 1'!M9,PAPI20_22_23[Ano previsto para início],2023)","v":0},0,0]
["2.1 - Planos",{"$f":"SUMIFS(#REF!,#REF!,A10,#REF!,2021)","v":{"$error":"#REF!"}},{"$f":"SUMIFS(#REF!,#REF!,A10,#REF!,2021)","v":{"$error":"#REF!"}},{"$f":"SUMIFS(#REF!,#REF!,A10,#REF!,2021)","v":{"$error":"#REF!"}},{"$f":"SUMIFS(#REF!,#REF!,A10,#REF!,2021)","v":{"$error":"#REF!"}},{"$error":"#REF!"},null,"2.6 - Integração",{"$f":"SUMIFS(PAPI20_22_23[Recurso financeiro estimado no ano (R$) - CFURH],PAPI20_22_23[SubPDC],'Consolidaçao - 1'!H10,PAPI20_22_23[Ano previsto para início],2022)","v":0},{"$f":"SUMIFS(PAPI20_22_23[Recurso financeiro estimado no ano\n(R$) - Cobrança Estadual],PAPI20_22_23[SubPDC],'Consolidaçao - 1'!H10,PAPI20_22_23[Ano previsto para início],2022)","v":0},{"$f":"SUMIFS(PAPI20_22_23[Recurso financeiro estimado no ano\n(R$) - Cobrança Federal],PAPI20_22_23[SubPDC],'Consolidaçao - 1'!H10,PAPI20_22_23[Ano previsto para início],2022)","v":0},{"$f":"SUMIFS(PAPI20_22_23[Recurso financeiro estimado no ano (R$) - Outras],PAPI20_22_23[SubPDC],'Consolidaçao - 1'!H10,PAPI20_22_23[Ano previsto para início],2022)","v":0},0,{"$f":"SUMIFS(PAPI20_22_23[Recurso financeiro estimado no ano (R$) - CFURH],PAPI20_22_23[SubPDC],'Consolidaçao - 1'!H10,PAPI20_22_23[Ano previsto para início],2023)","v":0},{"$f":"SUMIFS(PAPI20_22_23[Recurso financeiro estimado no ano\n(R$) - Cobrança Estadual],PAPI20_22_23[SubPDC],'Consolidaçao - 1'!M10,PAPI20_22_23[Ano previsto para início],2023)","v":0},{"$f":"SUMIFS(PAPI20_22_23[Recurso financeiro estimado no ano\n(R$) - Cobrança Federal],PAPI20_22_23[SubPDC],'Consolidaçao - 1'!M10,PAPI20_22_23[Ano previsto para início],2023)","v":0},{"$f":"SUMIFS(PAPI20_22_23[Recurso financeiro estimado no ano (R$) - Outras],PAPI20_22_23[SubPDC],'Consolidaçao - 1'!M10,PAPI20_22_23[Ano previsto para início],2023)","v":0},0,0]
["2.2 - Outorga",{"$f":"SUMIFS(#REF!,#REF!,A11,#REF!,2021)","v":{"$error":"#REF!"}},{"$f":"SUMIFS(#REF!,#REF!,A11,#REF!,2021)","v":{"$error":"#REF!"}},{"$f":"SUMIFS(#REF!,#REF!,A11,#REF!,2021)","v":{"$error":"#REF!"}},{"$f":"SUMIFS(#REF!,#REF!,A11,#REF!,2021)","v":{"$error":"#REF!"}},{"$error":"#REF!"},null,"2.7 - CORHI",{"$f":"SUMIFS(PAPI20_22_23[Recurso financeiro estimado no ano (R$) - CFURH],PAPI20_22_23[SubPDC],'Consolidaçao - 1'!H11,PAPI20_22_23[Ano previsto para início],2022)","v":0},{"$f":"SUMIFS(PAPI20_22_23[Recurso financeiro estimado no ano\n(R$) - Cobrança Estadual],PAPI20_22_23[SubPDC],'Consolidaçao - 1'!H11,PAPI20_22_23[Ano previsto para início],2022)","v":0},{"$f":"SUMIFS(PAPI20_22_23[Recurso financeiro estimado no ano\n(R$) - Cobrança Federal],PAPI20_22_23[SubPDC],'Consolidaçao - 1'!H11,PAPI20_22_23[Ano previsto para início],2022)","v":0},{"$f":"SUMIFS(PAPI20_22_23[Recurso financeiro estimado no ano (R$) - Outras],PAPI20_22_23[SubPDC],'Consolidaçao - 1'!H11,PAPI20_22_23[Ano previsto para início],2022)","v":0},0,{"$f":"SUMIFS(PAPI20_22_23[Recurso financeiro estimado no ano (R$) - CFURH],PAPI20_22_23[SubPDC],'Consolidaçao - 1'!H11,PAPI20_22_23[Ano previsto para início],2023)","v":0},{"$f":"SUMIFS(PAPI20_22_23[Recurso financeiro estimado no ano\n(R$) - Cobrança Estadual],PAPI20_22_23[SubPDC],'Consolidaçao - 1'!M11,PAPI20_22_23[Ano previsto para início],2023)","v":0},{"$f":"SUMIFS(PAPI20_22_23[Recurso financeiro estimado no ano\n(R$) - Cobrança Federal],PAPI20_22_23[SubPDC],'Consolidaçao - 1'!M11,PAPI20_22_23[Ano previsto para início],2023)","v":0},{"$f":"SUMIFS(PAPI20_22_23[Recurso financeiro estimado no ano (R$) - Outras],PAPI20_22_23[SubPDC],'Consolidaçao - 1'!M11,PAPI20_22_23[Ano previsto para início],2023)","v":0},0,0]
["2.3 - Cobrança",{"$f":"SUMIFS(#REF!,#REF!,A12,#REF!,2021)","v":{"$error":"#REF!"}},{"$f":"SUMIFS(#REF!,#REF!,A12,#REF!,2021)","v":{"$error":"#REF!"}},{"$f":"SUMIFS(#REF!,#REF!,A12,#REF!,2021)","v":{"$error":"#REF!"}},{"$f":"SUMIFS(#REF!,#REF!,A12,#REF!,2021)","v":{"$error":"#REF!"}},{"$error":"#REF!"},null,"3.1 - Efluentes",{"$f":"SUMIFS(PAPI20_22_23[Recurso financeiro estimado no ano (R$) - CFURH],PAPI20_22_23[SubPDC],'Consolidaçao - 1'!H12,PAPI20_22_23[Ano previsto para início],2022)","v":0},{"$f":"SUMIFS(PAPI20_22_23[Recurso financeiro estimado no ano\n(R$) - Cobrança Estadual],PAPI20_22_23[SubPDC],'Consolidaçao - 1'!H12,PAPI20_22_23[Ano previsto para início],2022)","v":0},{"$f":"SUMIFS(PAPI20_22_23[Recurso financeiro estimado no ano\n(R$) - Cobrança Federal],PAPI20_22_23[SubPDC],'Consolidaçao - 1'!H12,PAPI20_22_23[Ano previsto para início],2022)","v":0},{"$f":"SUMIFS(PAPI20_22_23[Recurso financeiro estimado no ano (R$) - Outras],PAPI20_22_23[SubPDC],'Consolidaçao - 1'!H12,PAPI20_22_23[Ano previsto para início],2022)","v":0},0,{"$f":"SUMIFS(PAPI20_22_23[Recurso financeiro estimado no ano (R$) - CFURH],PAPI20_22_23[SubPDC],'Consolidaçao - 1'!H12,PAPI20_22_23[Ano previsto para início],2023)","v":0},{"$f":"SUMIFS(PAPI20_22_23[Recurso financeiro estimado no ano\n(R$) - Cobrança Estadual],PAPI20_22_23[SubPDC],'Consolidaçao - 1'!M12,PAPI20_22_23[Ano previsto para início],2023)","v":0},{"$f":"SUMIFS(PAPI20_22_23[Recurso financeiro estimado no ano\n(R$) - Cobrança Federal],PAPI20_22_23[SubPDC],'Consolidaçao - 1'!M12,PAPI20_22_23[Ano previsto para início],2023)","v":0},{"$f":"SUMIFS(PAPI20_22_23[Recurso financeiro estimado no ano (R$) - Outras],PAPI20_22_23[SubPDC],'Consolidaçao - 1'!M12,PAPI20_22_23[Ano previsto para início],2023)","v":0},0,0]
["2.4 - Efetivação",{"$f":"SUMIFS(#REF!,#REF!,A13,#REF!,2021)","v":{"$error":"#REF!"}},{"$f":"SUMIFS(#REF!,#REF!,A13,#REF!,2021)","v":{"$error":"#REF!"}},{"$f":"SUMIFS(#REF!,#REF!,A13,#REF!,2021)","v":{"$error":"#REF!"}},{"$f":"SUMIFS(#REF!,#REF!,A13,#REF!,2021)","v":{"$error":"#REF!"}},{"$error":"#REF!"},null,"3.2 - Poluição",{"$f":"SUMIFS(PAPI20_22_23[Recurso financeiro estimado no ano (R$) - CFURH],PAPI20_22_23[SubPDC],'Consolidaçao - 1'!H13,PAPI20_22_23[Ano previsto para início],2022)","v":0},{"$f":"SUMIFS(PAPI20_22_23[Recurso financeiro estimado no ano\n(R$) - Cobrança Estadual],PAPI20_22_23[SubPDC],'Consolidaçao - 1'!H13,PAPI20_22_23[Ano previsto para início],2022)","v":0},{"$f":"SUMIFS(PAPI20_22_23[Recurso financeiro estimado no ano\n(R$) - Cobrança Federal],PAPI20_22_23[SubPDC],'Consolidaçao - 1'!H13,PAPI20_22_23[Ano previsto para início],2022)","v":0},{"$f":"SUMIFS(PAPI20_22_23[Recurso financeiro estimado no ano (R$) - Outras],PAPI20_22_23[SubPDC],'Consolidaçao - 1'!H13,PAPI20_22_23[Ano previsto para início],2022)","v":0},0,{"$f":"SUMIFS(PAPI20_22_23[Recurso financeiro estimado no ano (R$) - CFURH],PAPI20_22_23[SubPDC],'Consolidaçao - 1'!H13,PAPI20_22_23[Ano previsto para início],2023)","v":0},{"$f":"SUMIFS(PAPI20_22_23[Recurso financeiro estimado no ano\n(R$) - Cobrança Estadual],PAPI20_22_23[SubPDC],'Consolidaçao - 1'!M13,PAPI20_22_23[Ano previsto para início],2023)","v":0},{"$f":"SUMIFS(PAPI20_22_23[Recurso financeiro estimado no ano\n(R$) - Cobrança Federal],PAPI20_22_23[SubPDC],'Consolidaçao - 1'!M13,PAPI20_22_23[Ano previsto para início],2023)","v":0},{"$f":"SUMIFS(PAPI20_22_23[Recurso financeiro estimado no ano (R$) - Outras],PAPI20_22_23[SubPDC],'Consolidaçao - 1'!M13,PAPI20_22_23[Ano previsto para início],2023)","v":0},0,0]
["2.5 - Integração",{"$f":"SUMIFS(#REF!,#REF!,A14,#REF!,2021)","v":{"$error":"#REF!"}},{"$f":"SUMIFS(#REF!,#REF!,A14,#REF!,2021)","v":{"$error":"#REF!"}},{"$f":"SUMIFS(#REF!,#REF!,A14,#REF!,2021)","v":{"$error":"#REF!"}},{"$f":"SUMIFS(#REF!,#REF!,A14,#REF!,2021)","v":{"$error":"#REF!"}},{"$error":"#REF!"},null,"3.3 - Resíduos",{"$f":"SUMIFS(PAPI20_22_23[Recurso financeiro estimado no ano (R$) - CFURH],PAPI20_22_23[SubPDC],'Consolidaçao - 1'!H14,PAPI20_22_23[Ano previsto para início],2022)","v":0},{"$f":"SUMIFS(PAPI20_22_23[Recurso financeiro estimado no ano\n(R$) - Cobrança Estadual],PAPI20_22_23[SubPDC],'Consolidaçao - 1'!H14,PAPI20_22_23[Ano previsto para início],2022)","v":0},{"$f":"SUMIFS(PAPI20_22_23[Recurso financeiro estimado no ano\n(R$) - Cobrança Federal],PAPI20_22_23[SubPDC],'Consolidaçao - 1'!H14,PAPI20_22_23[Ano previsto para início],2022)","v":0},{"$f":"SUMIFS(PAPI20_22_23[Recurso financeiro estimado no ano (R$) - Outras],PAPI20_22_23[SubPDC],'Consolidaçao - 1'!H14,PAPI20_22_23[Ano previsto para início],2022)","v":0},0,{"$f":"SUMIFS(PAPI20_22_23[Recurso financeiro estimado no ano (R$) - CFURH],PAPI20_22_23[SubPDC],'Consolidaçao - 1'!H14,PAPI20_22_23[Ano previsto para início],2023)","v":0},{"$f":"SUMIFS(PAPI20_22_23[Recurso financeiro estimado no ano\n(R$) - Cobrança Estadual],PAPI20_22_23[SubPDC],'Consolidaçao - 1'!M14,PAPI20_22_23[Ano previsto para início],2023)","v":0},{"$f":"SUMIFS(PAPI20_22_23[Recurso financeiro estimado no ano\n(R$) - Cobrança Federal],PAPI20_22_23[SubPDC],'Consolidaçao - 1'!M14,PAPI20_22_23[Ano previsto para início],2023)","v":0},{"$f":"SUMIFS(PAPI20_22_23[Recurso financeiro estimado no ano (R$) - Outras],PAPI20_22_23[SubPDC],'Consolidaçao - 1'!M14,PAPI20_22_23[Ano previsto para início],2023)","v":0},0,0]
["2.6 - CORHI",{"$f":"SUMIFS(#REF!,#REF!,A15,#REF!,2021)","v":{"$error":"#REF!"}},{"$f":"SUMIFS(#REF!,#REF!,A15,#REF!,2021)","v":{"$error":"#REF!"}},{"$f":"SUMIFS(#REF!,#REF!,A15,#REF!,2021)","v":{"$error":"#REF!"}},{"$f":"SUMIFS(#REF!,#REF!,A15,#REF!,2021)","v":{"$error":"#REF!"}},{"$error":"#REF!"},null,"3.4 - Intervenções",{"$f":"SUMIFS(PAPI20_22_23[Recurso financeiro estimado no ano (R$) - CFURH],PAPI20_22_23[SubPDC],'Consolidaçao - 1'!H15,PAPI20_22_23[Ano previsto para início],2022)","v":0},{"$f":"SUMIFS(PAPI20_22_23[Recurso financeiro estimado no ano\n(R$) - Cobrança Estadual],PAPI20_22_23[SubPDC],'Consolidaçao - 1'!H15,PAPI20_22_23[Ano previsto para início],2022)","v":0},{"$f":"SUMIFS(PAPI20_22_23[Recurso financeiro estimado no ano\n(R$) - Cobrança Federal],PAPI20_22_23[SubPDC],'Consolidaçao - 1'!H15,PAPI20_22_23[Ano previsto para início],2022)","v":0},{"$f":"SUMIFS(PAPI20_22_23[Recurso financeiro estimado no ano (R$) - Outras],PAPI20_22_23[SubPDC],'Consolidaçao - 1'!H15,PAPI20_22_23[Ano previsto para início],2022)","v":0},0,{"$f":"SUMIFS(PAPI20_22_23[Recurso financeiro estimado no ano (R$) - CFURH],PAPI20_22_23[SubPDC],'Consolidaçao - 1'!H15,PAPI20_22_23[Ano previsto para início],2023)","v":0},{"$f":"SUMIFS(PAPI20_22_23[Recurso financeiro estimado no ano\n(R$) - Cobrança Estadual],PAPI20_22_23[SubPDC],'Consolidaçao - 1'!H15,PAPI20_22_23[Ano previsto para início],2023)","v":0},{"$f":"SUMIFS(PAPI20_22_23[Recurso financeiro estimado no ano\n(R$) - Cobrança Federal],PAPI20_22_23[SubPDC],'Consolidaçao - 1'!H15,PAPI20_22_23[Ano previsto para início],2023)","v":0},{"$f":"SUMIFS(PAPI20_22_23[Recurso financeiro estimado no ano (R$) - Outras],PAPI20_22_23[SubPDC],'Consolidaçao - 1'!H15,PAPI20_22_23[Ano previsto para início],2023)","v":0},0,0]
["3.1 - Efluentes",{"$f":"SUMIFS(#REF!,#REF!,A16,#REF!,2021)","v":{"$error":"#REF!"}},{"$f":"SUMIFS(#REF!,#REF!,A16,#REF!,2021)","v":{"$error":"#REF!"}},{"$f":"SUMIFS(#REF!,#REF!,A16,#REF!,2021)","v":{"$error":"#REF!"}},{"$f":"SUMIFS(#REF!,#REF!,A16,#REF!,2021)","v":{"$error":"#REF!"}},{"$error":"#REF!"},null,"4.1 - Erosão",{"$f":"SUMIFS(PAPI20_22_23[Recurso financeiro estimado no ano (R$) - CFURH],PAPI20_22_23[SubPDC],'Consolidaçao - 1'!H16,PAPI20_22_23[Ano previsto para início],2022)","v":0},{"$f":"SUMIFS(PAPI20_22_23[Recurso financeiro estimado no ano\n(R$) - Cobrança Estadual],PAPI20_22_23[SubPDC],'Consolidaçao - 1'!H16,PAPI20_22_23[Ano previsto para início],2022)","v":0},{"$f":"SUMIFS(PAPI20_22_23[Recurso financeiro estimado no ano\n(R$) - Cobrança Federal],PAPI20_22_23[SubPDC],'Consolidaçao - 1'!H16,PAPI20_22_23[Ano previsto para início],2022)","v":0},{"$f":"SUMIFS(PAPI20_22_23[Recurso financeiro estimado no ano (R$) - Outras],PAPI20_22_23[SubPDC],'Consolidaçao - 1'!H16,PAPI20_22_23[Ano previsto para início],2022)","v":0},0,{"$f":"SUMIFS(PAPI20_22_23[Recurso financeiro estimado no ano (R$) - CFURH],PAPI20_22_23[SubPDC],'Consolidaçao - 1'!H16,PAPI20_22_23[Ano previsto para início],2023)","v":0},{"$f":"SUMIFS(PAPI20_22_23[Recurso financeiro estimado no ano\n(R$) - Cobrança Estadual],PAPI20_22_23[SubPDC],'Consolidaçao - 1'!H16,PAPI20_22_23[Ano previsto para início],2023)","v":0},{"$f":"SUMIFS(PAPI20_22_23[Recurso financeiro estimado no ano\n(R$) - Cobrança Federal],PAPI20_22_23[SubPDC],'Consolidaçao - 1'!H16,PAPI20_22_23[Ano previsto para início],2023)","v":0},{"$f":"SUMIFS(PAPI20_22_23[Recurso financeiro estimado no ano (R$) - Outras],PAPI20_22_23[SubPDC],'Consolidaçao - 1'!H16,PAPI20_22_23[Ano previsto para início],2023)","v":0},0,0]
["3.2 - Resíduos",{"$f":"SUMIFS(#REF!,#REF!,A17,#REF!,2021)","v":{"$error":"#REF!"}},{"$f":"SUMIFS(#REF!,#REF!,A17,#REF!,2021)","v":{"$error":"#REF!"}},{"$f":"SUMIFS(#REF!,#REF!,A17,#REF!,2021)","v":{"$error":"#REF!"}},{"$f":"SUMIFS(#REF!,#REF!,A17,#REF!,2021)","v":{"$error":"#REF!"}},{"$error":"#REF!"},null,"4.2 - Conservação",{"$f":"SUMIFS(PAPI20_22_23[Recurso financeiro estimado no ano (R$) - CFURH],PAPI20_22_23[SubPDC],'Consolidaçao - 1'!H17,PAPI20_22_23[Ano previsto para início],2022)","v":0},{"$f":"SUMIFS(PAPI20_22_23[Recurso financeiro estimado no ano\n(R$) - Cobrança Estadual],PAPI20_22_23[SubPDC],'Consolidaçao - 1'!H17,PAPI20_22_23[Ano previsto para início],2022)","v":0},{"$f":"SUMIFS(PAPI20_22_23[Recurso financeiro estimado no ano\n(R$) - Cobrança Federal],PAPI20_22_23[SubPDC],'Consolidaçao - 1'!H17,PAPI20_22_23[Ano previsto para início],2022)","v":0},{"$f":"SUMIFS(PAPI20_22_23[Recurso financeiro estimado no ano (R$) - Outras],PAPI20_22_23[SubPDC],'Consolidaçao - 1'!H17,PAPI20_22_23[Ano previsto para início],2022)","v":0},0,{"$f":"SUMIFS(PAPI20_22_23[Recurso financeiro estimado no ano (R$) - CFURH],PAPI20_22_23[SubPDC],'Consolidaçao - 1'!H17,PAPI20_22_23[Ano previsto para início],2023)","v":0},{"$f":"SUMIFS(PAPI20_22_23[Recurso financeiro estimado no ano\n(R$) - Cobrança Estadual],PAPI20_22_23[SubPDC],'Consolidaçao - 1'!H17,PAPI20_22_23[Ano previsto para início],2023)","v":0},{"$f":"SUMIFS(PAPI20_22_23[Recurso financeiro estimado no ano\n(R$) - Cobrança Federal],PAPI20_22_23[SubPDC],'Consolidaçao - 1'!H17,PAPI20_22_23[Ano previsto para início],2023)","v":0},{"$f":"SUMIFS(PAPI20_22_23[Recurso financeiro estimado no ano (R$) - Outras],PAPI20_22_23[SubPDC],'Consolidaçao - 1'!H17,PAPI20_22_23[Ano previsto para início],2023)","v":0},0,0]
["3.3 - Drenagem",{"$f":"SUMIFS(#REF!,#REF!,A18,#REF!,2021)","v":{"$error":"#REF!"}},{"$f":"SUMIFS(#REF!,#REF!,A18,#REF!,2021)","v":{"$error":"#REF!"}},{"$f":"SUMIFS(#REF!,#REF!,A18,#REF!,2021)","v":{"$error":"#REF!"}},{"$f":"SUMIFS(#REF!,#REF!,A18,#REF!,2021)","v":{"$error":"#REF!"}},{"$error":"#REF!"},null,"4.3 - Mananciais",{"$f":"SUMIFS(PAPI20_22_23[Recurso financeiro estimado no ano (R$) - CFURH],PAPI20_22_23[SubPDC],'Consolidaçao - 1'!H18,PAPI20_22_23[Ano previsto para início],2022)","v":0},{"$f":"SUMIFS(PAPI20_22_23[Recurso financeiro estimado no ano\n(R$) - Cobrança Estadual],PAPI20_22_23[SubPDC],'Consolidaçao - 1'!H18,PAPI20_22_23[Ano previsto para início],2022)","v":0},{"$f":"SUMIFS(PAPI20_22_23[Recurso financeiro estimado no ano\n(R$) - Cobrança Federal],PAPI20_22_23[SubPDC],'Consolidaçao - 1'!H18,PAPI20_22_23[Ano previsto para início],2022)","v":0},{"$f":"SUMIFS(PAPI20_22_23[Recurso financeiro estimado no ano (R$) - Outras],PAPI20_22_23[SubPDC],'Consolidaçao - 1'!H18,PAPI20_22_23[Ano previsto para início],2022)","v":0},0,{"$f":"SUMIFS(PAPI20_22_23[Recurso financeiro estimado no ano (R$) - CFURH],PAPI20_22_23[SubPDC],'Consolidaçao - 1'!H18,PAPI20_22_23[Ano previsto para início],2023)","v":0},{"$f":"SUMIFS(PAPI20_22_23[Recurso financeiro estimado no ano\n(R$) - Cobrança Estadual],PAPI20_22_23[SubPDC],'Consolidaçao - 1'!H18,PAPI20_22_23[Ano previsto para início],2023)","v":0},{"$f":"SUMIFS(PAPI20_22_23[Recurso financeiro estimado no ano\n(R$) - Cobrança Federal],PAPI20_22_23[SubPDC],'Consolidaçao - 1'!H18,PAPI20_22_23[Ano previsto para início],2023)","v":0},{"$f":"SUMIFS(PAPI20_22_23[Recurso financeiro estimado no ano (R$) - Outras],PAPI20_22_23[SubPDC],'Consolidaçao - 1'!H18,PAPI20_22_23[Ano previsto para início],2023)","v":0},0,0]
["3.4 - Erosão",{"$f":"SUMIFS(#REF!,#REF!,A19,#REF!,2021)","v":{"$error":"#REF!"}},{"$f":"SUMIFS(#REF!,#REF!,A19,#REF!,2021)","v":{"$error":"#REF!"}},{"$f":"SUMIFS(#REF!,#REF!,A19,#REF!,2021)","v":{"$error":"#REF!"}},{"$f":"SUMIFS(#REF!,#REF!,A19,#REF!,2021)","v":{"$error":"#REF!"}},{"$error":"#REF!"},null,"5.1 - Perdas",{"$f":"SUMIFS(PAPI20_22_23[Recurso financeiro estimado no ano (R$) - CFURH],PAPI20_22_23[SubPDC],'Consolidaçao - 1'!H19,PAPI20_22_23[Ano previsto para início],2022)","v":0},{"$f":"SUMIFS(PAPI20_22_23[Recurso financeiro estimado no ano\n(R$) - Cobrança Estadual],PAPI20_22_23[SubPDC],'Consolidaçao - 1'!H19,PAPI20_22_23[Ano previsto para início],2022)","v":0},{"$f":"SUMIFS(PAPI20_22_23[Recurso financeiro estimado no ano\n(R$) - Cobrança Federal],PAPI20_22_23[SubPDC],'Consolidaçao - 1'!H19,PAPI20_22_23[Ano previsto para início],2022)","v":0},{"$f":"SUMIFS(PAPI20_22_23[Recurso financeiro estimado no ano (R$) - Outras],PAPI20_22_23[SubPDC],'Consolidaçao - 1'!H19,PAPI20_22_23[Ano previsto para início],2022)","v":0},0,{"$f":"SUMIFS(PAPI20_22_23[Recurso financeiro estimado no ano (R$) - CFURH],PAPI20_22_23[SubPDC],'Consolidaçao - 1'!H19,PAPI20_22_23[Ano previsto para início],2023)","v":0},{"$f":"SUMIFS(PAPI20_22_23[Recurso financeiro estimado no ano\n(R$) - Cobrança Estadual],PAPI20_22_23[SubPDC],'Consolidaçao - 1'!H19,PAPI20_22_23[Ano previsto para início],2023)","v":0},{"$f":"SUMIFS(PAPI20_22_23[Recurso financeiro estimado no ano\n(R$) - Cobrança Federal],PAPI20_22_23[SubPDC],'Consolidaçao - 1'!H19,PAPI20_22_23[Ano previsto para início],2023)","v":0},{"$f":"SUMIFS(PAPI20_22_23[Recurso financeiro estimado no ano (R$) - Outras],PAPI20_22_23[SubPDC],'Consolidaçao - 1'!H19,PAPI20_22_23[Ano previsto para início],2023)","v":0},0,0]
["3.5 - Intervenções",{"$f":"SUMIFS(#REF!,#REF!,A20,#REF!,2021)","v":{"$error":"#REF!"}},{"$f":"SUMIFS(#REF!,#REF!,A20,#REF!,2021)","v":{"$error":"#REF!"}},{"$f":"SUMIFS(#REF!,#REF!,A20,#REF!,2021)","v":{"$error":"#REF!"}},{"$f":"SUMIFS(#REF!,#REF!,A20,#REF!,2021)","v":{"$error":"#REF!"}},{"$error":"#REF!"},null,"5.2 - Racionalização",{"$f":"SUMIFS(PAPI20_22_23[Recurso financeiro estimado no ano (R$) - CFURH],PAPI20_22_23[SubPDC],'Consolidaçao - 1'!H20,PAPI20_22_23[Ano previsto para início],2022)","v":0},{"$f":"SUMIFS(PAPI20_22_23[Recurso financeiro estimado no ano\n(R$) - Cobrança Estadual],PAPI20_22_23[SubPDC],'Consolidaçao - 1'!H20,PAPI20_22_23[Ano previsto para início],2022)","v":0},{"$f":"SUMIFS(PAPI20_22_23[Recurso financeiro estimado no ano\n(R$) - Cobrança Federal],PAPI20_22_23[SubPDC],'Consolidaçao - 1'!H20,PAPI20_22_23[Ano previsto para início],2022)","v":0},{"$f":"SUMIFS(PAPI20_22_23[Recurso financeiro estimado no ano (R$) - Outras],PAPI20_22_23[SubPDC],'Consolidaçao - 1'!H20,PAPI20_22_23[Ano previsto para início],2022)","v":0},0,{"$f":"SUMIFS(PAPI20_22_23[Recurso financeiro estimado no ano (R$) - CFURH],PAPI20_22_23[SubPDC],'Consolidaçao - 1'!H20,PAPI20_22_23[Ano previsto para início],2023)","v":0},{"$f":"SUMIFS(PAPI20_22_23[Recurso financeiro estimado no ano\n(R$) - Cobrança Estadual],PAPI20_22_23[SubPDC],'Consolidaçao - 1'!H20,PAPI20_22_23[Ano previsto para início],2023)","v":0},{"$f":"SUMIFS(PAPI20_22_23[Recurso financeiro estimado no ano\n(R$) - Cobrança Federal],PAPI20_22_23[SubPDC],'Consolidaçao - 1'!H20,PAPI20_22_23[Ano previsto para início],2023)","v":0},{"$f":"SUMIFS(PAPI20_22_23[Recurso financeiro estimado no ano (R$) - Outras],PAPI20_22_23[SubPDC],'Consolidaçao - 1'!H20,PAPI20_22_23[Ano previsto para início],2023)","v":0},0,0]
["4.1 - Mananciais",{"$f":"SUMIFS(#REF!,#REF!,A21,#REF!,2021)","v":{"$error":"#REF!"}},{"$f":"SUMIFS(#REF!,#REF!,A21,#REF!,2021)","v":{"$error":"#REF!"}},{"$f":"SUMIFS(#REF!,#REF!,A21,#REF!,2021)","v":{"$error":"#REF!"}},{"$f":"SUMIFS(#REF!,#REF!,A21,#REF!,2021)","v":{"$error":"#REF!"}},{"$error":"#REF!"},null,"5.3 - Reuso",{"$f":"SUMIFS(PAPI20_22_23[Recurso financeiro estimado no ano (R$) - CFURH],PAPI20_22_23[SubPDC],'Consolidaçao - 1'!H21,PAPI20_22_23[Ano previsto para início],2022)","v":0},{"$f":"SUMIFS(PAPI20_22_23[Recurso financeiro estimado no ano\n(R$) - Cobrança Estadual],PAPI20_22_23[SubPDC],'Consolidaçao - 1'!H21,PAPI20_22_23[Ano previsto para início],2022)","v":0},{"$f":"SUMIFS(PAPI20_22_23[Recurso financeiro estimado no ano\n(R$) - Cobrança Federal],PAPI20_22_23[SubPDC],'Consolidaçao - 1'!H21,PAPI20_22_23[Ano previsto para início],2022)","v":0},{"$f":"SUMIFS(PAPI20_22_23[Recurso financeiro estimado no ano (R$) - Outras],PAPI20_22_23[SubPDC],'Consolidaçao - 1'!H21,PAPI20_22_23[Ano previsto para início],2022)","v":0},0,{"$f":"SUMIFS(PAPI20_22_23[Recurso financeiro estimado no ano (R$) - CFURH],PAPI20_22_23[SubPDC],'Consolidaçao - 1'!H21,PAPI20_22_23[Ano previsto para início],2023)","v":0},{"$f":"SUMIFS(PAPI20_22_23[Recurso financeiro estimado no ano\n(R$) - Cobrança Estadual],PAPI20_22_23[SubPDC],'Consolidaçao - 1'!H21,PAPI20_22_23[Ano previsto para início],2023)","v":0},{"$f":"SUMIFS(PAPI20_22_23[Recurso financeiro estimado no ano\n(R$) - Cobrança Federal],PAPI20_22_23[SubPDC],'Consolidaçao - 1'!H21,PAPI20_22_23[Ano previsto para início],2023)","v":0},{"$f":"SUMIFS(PAPI20_22_23[Recurso financeiro estimado no ano (R$) - Outras],PAPI20_22_23[SubPDC],'Consolidaçao - 1'!H21,PAPI20_22_23[Ano previsto para início],2023)","v":0},0,0]
["4.2 - Vegetação",{"$f":"SUMIFS(#REF!,#REF!,A22,#REF!,2021)","v":{"$error":"#REF!"}},{"$f":"SUMIFS(#REF!,#REF!,A22,#REF!,2021)","v":{"$error":"#REF!"}},{"$f":"SUMIFS(#REF!,#REF!,A22,#REF!,2021)","v":{"$error":"#REF!"}},{"$f":"SUMIFS(#REF!,#REF!,A22,#REF!,2021)","v":{"$error":"#REF!"}},{"$error":"#REF!"},null,"6.1 - Captação",{"$f":"SUMIFS(PAPI20_22_23[Recurso financeiro estimado no ano (R$) - CFURH],PAPI20_22_23[SubPDC],'Consolidaçao - 1'!H22,PAPI20_22_23[Ano previsto para início],2022)","v":0},{"$f":"SUMIFS(PAPI20_22_23[Recurso financeiro estimado no ano\n(R$) - Cobrança Estadual],PAPI20_22_23[SubPDC],'Consolidaçao - 1'!H22,PAPI20_22_23[Ano previsto para início],2022)","v":0},{"$f":"SUMIFS(PAPI20_22_23[Recurso financeiro estimado no ano\n(R$) - Cobrança Federal],PAPI20_22_23[SubPDC],'Consolidaçao - 1'!H22,PAPI20_22_23[Ano previsto para início],2022)","v":0},{"$f":"SUMIFS(PAPI20_22_23[Recurso financeiro estimado no ano (R$) - Outras],PAPI20_22_23[SubPDC],'Consolidaçao - 1'!H22,PAPI20_22_23[Ano previsto para início],2022)","v":0},0,{"$f":"SUMIFS(PAPI20_22_23[Recurso financeiro estimado no ano (R$) - CFURH],PAPI20_22_23[SubPDC],'Consolidaçao - 1'!H22,PAPI20_22_23[Ano previsto para início],2023)","v":0},{"$f":"SUMIFS(PAPI20_22_23[Recurso financeiro estimado no ano\n(R$) - Cobrança Estadual],PAPI20_22_23[SubPDC],'Consolidaçao - 1'!H22,PAPI20_22_23[Ano previsto para início],2023)","v":0},{"$f":"SUMIFS(PAPI20_22_23[Recurso financeiro estimado no ano\n(R$) - Cobrança Federal],PAPI20_22_23[SubPDC],'Consolidaçao - 1'!H22,PAPI20_22_23[Ano previsto para início],2023)","v":0},{"$f":"SUMIFS(PAPI20_22_23[Recurso financeiro estimado no ano (R$) - Outras],PAPI20_22_23[SubPDC],'Consolidaçao - 1'!H22,PAPI20_22_23[Ano previsto para início],2023)","v":0},0,0]
["5.1 - Perdas",{"$f":"SUMIFS(#REF!,#REF!,A23,#REF!,2021)","v":{"$error":"#REF!"}},{"$f":"SUMIFS(#REF!,#REF!,A23,#REF!,2021)","v":{"$error":"#REF!"}},{"$f":"SUMIFS(#REF!,#REF!,A23,#REF!,2021)","v":{"$error":"#REF!"}},{"$f":"SUMIFS(#REF!,#REF!,A23,#REF!,2021)","v":{"$error":"#REF!"}},{"$error":"#REF!"},null,"6.2 - Regularização",{"$f":"SUMIFS(PAPI20_22_23[Recurso financeiro estimado no ano (R$) - CFURH],PAPI20_22_23[SubPDC],'Consolidaçao - 1'!H23,PAPI20_22_23[Ano previsto para início],2022)","v":0},{"$f":"SUMIFS(PAPI20_22_23[Recurso financeiro estimado no ano\n(R$) - Cobrança Estadual],PAPI20_22_23[SubPDC],'Consolidaçao - 1'!H23,PAPI20_22_23[Ano previsto para início],2022)","v":0},{"$f":"SUMIFS(PAPI20_22_23[Recurso financeiro estimado no ano\n(R$) - Cobrança Federal],PAPI20_22_23[SubPDC],'Consolidaçao - 1'!H23,PAPI20_22_23[Ano previsto para início],2022)","v":0},{"$f":"SUMIFS(PAPI20_22_23[Recurso financeiro estimado no ano (R$) - Outras],PAPI20_22_23[SubPDC],'Consolidaçao - 1'!H23,PAPI20_22_23[Ano previsto para início],2022)","v":0},0,{"$f":"SUMIFS(PAPI20_22_23[Recurso financeiro estimado no ano (R$) - CFURH],PAPI20_22_23[SubPDC],'Consolidaçao - 1'!H23,PAPI20_22_23[Ano previsto para início],2023)","v":0},{"$f":"SUMIFS(PAPI20_22_23[Recurso financeiro estimado no ano\n(R$) - Cobrança Estadual],PAPI20_22_23[SubPDC],'Consolidaçao - 1'!H23,PAPI20_22_23[Ano previsto para início],2023)","v":0},{"$f":"SUMIFS(PAPI20_22_23[Recurso financeiro estimado no ano\n(R$) - Cobrança Federal],PAPI20_22_23[SubPDC],'Consolidaçao - 1'!H23,PAPI20_22_23[Ano previsto para início],2023)","v":0},{"$f":"SUMIFS(PAPI20_22_23[Recurso financeiro estimado no ano (R$) - Outras],PAPI20_22_23[SubPDC],'Consolidaçao - 1'!H23,PAPI20_22_23[Ano previsto para início],2023)","v":0},0,0]
["5.2 - Racionalização",{"$f":"SUMIFS(#REF!,#REF!,A24,#REF!,2021)","v":{"$error":"#REF!"}},{"$f":"SUMIFS(#REF!,#REF!,A24,#REF!,2021)","v":{"$error":"#REF!"}},{"$f":"SUMIFS(#REF!,#REF!,A24,#REF!,2021)","v":{"$error":"#REF!"}},{"$f":"SUMIFS(#REF!,#REF!,A24,#REF!,2021)","v":{"$error":"#REF!"}},{"$error":"#REF!"},null,"7.1 - Drenagem",{"$f":"SUMIFS(PAPI20_22_23[Recurso financeiro estimado no ano (R$) - CFURH],PAPI20_22_23[SubPDC],'Consolidaçao - 1'!H24,PAPI20_22_23[Ano previsto para início],2022)","v":0},{"$f":"SUMIFS(PAPI20_22_23[Recurso financeiro estimado no ano\n(R$) - Cobrança Estadual],PAPI20_22_23[SubPDC],'Consolidaçao - 1'!H24,PAPI20_22_23[Ano previsto para início],2022)","v":0},{"$f":"SUMIFS(PAPI20_22_23[Recurso financeiro estimado no ano\n(R$) - Cobrança Federal],PAPI20_22_23[SubPDC],'Consolidaçao - 1'!H24,PAPI20_22_23[Ano previsto para início],2022)","v":0},{"$f":"SUMIFS(PAPI20_22_23[Recurso financeiro estimado no ano (R$) - Outras],PAPI20_22_23[SubPDC],'Consolidaçao - 1'!H24,PAPI20_22_23[Ano previsto para início],2022)","v":0},0,{"$f":"SUMIFS(PAPI20_22_23[Recurso financeiro estimado no ano (R$) - CFURH],PAPI20_22_23[SubPDC],'Consolidaçao - 1'!H24,PAPI20_22_23[Ano previsto para início],2023)","v":0},{"$f":"SUMIFS(PAPI20_22_23[Recurso financeiro estimado no ano\n(R$) - Cobrança Estadual],PAPI20_22_23[SubPDC],'Consolidaçao - 1'!H24,PAPI20_22_23[Ano previsto para início],2023)","v":0},{"$f":"SUMIFS(PAPI20_22_23[Recurso financeiro estimado no ano\n(R$) - Cobrança Federal],PAPI20_22_23[SubPDC],'Consolidaçao - 1'!H24,PAPI20_22_23[Ano previsto para início],2023)","v":0},{"$f":"SUMIFS(PAPI20_22_23[Recurso financeiro estimado no ano (R$) - Outras],PAPI20_22_23[SubPDC],'Consolidaçao - 1'!H24,PAPI20_22_23[Ano previsto para início],2023)","v":0},0,0]
["5.3 - Reuso",{"$f":"SUMIFS(#REF!,#REF!,A25,#REF!,2021)","v":{"$error":"#REF!"}},{"$f":"SUMIFS(#REF!,#REF!,A25,#REF!,2021)","v":{"$error":"#REF!"}},{"$f":"SUMIFS(#REF!,#REF!,A25,#REF!,2021)","v":{"$error":"#REF!"}},{"$f":"SUMIFS(#REF!,#REF!,A25,#REF!,2021)","v":{"$error":"#REF!"}},{"$error":"#REF!"},null,"7.2 - Escassez",{"$f":"SUMIFS(PAPI20_22_23[Recurso financeiro estimado no ano (R$) - CFURH],PAPI20_22_23[SubPDC],'Consolidaçao - 1'!H25,PAPI20_22_23[Ano previsto para início],2022)","v":0},{"$f":"SUMIFS(PAPI20_22_23[Recurso financeiro estimado no ano\n(R$) - Cobrança Estadual],PAPI20_22_23[SubPDC],'Consolidaçao - 1'!H25,PAPI20_22_23[Ano previsto para início],2022)","v":0},{"$f":"SUMIFS(PAPI20_22_23[Recurso financeiro estimado no ano\n(R$) - Cobrança Federal],PAPI20_22_23[SubPDC],'Consolidaçao - 1'!H25,PAPI20_22_23[Ano previsto para início],2022)","v":0},{"$f":"SUMIFS(PAPI20_22_23[Recurso financeiro estimado no ano (R$) - Outras],PAPI20_22_23[SubPDC],'Consolidaçao - 1'!H25,PAPI20_22_23[Ano previsto para início],2022)","v":0},0,{"$f":"SUMIFS(PAPI20_22_23[Recurso financeiro estimado no ano (R$) - CFURH],PAPI20_22_23[SubPDC],'Consolidaçao - 1'!H25,PAPI20_22_23[Ano previsto para início],2023)","v":0},{"$f":"SUMIFS(PAPI20_22_23[Recurso financeiro estimado no ano\n(R$) - Cobrança Estadual],PAPI20_22_23[SubPDC],'Consolidaçao - 1'!H25,PAPI20_22_23[Ano previsto para início],2023)","v":0},{"$f":"SUMIFS(PAPI20_22_23[Recurso financeiro estimado no ano\n(R$) - Cobrança Federal],PAPI20_22_23[SubPDC],'Consolidaçao - 1'!H25,PAPI20_22_23[Ano previsto para início],2023)","v":0},{"$f":"SUMIFS(PAPI20_22_23[Recurso financeiro estimado no ano (R$) - Outras],PAPI20_22_23[SubPDC],'Consolidaçao - 1'!H25,PAPI20_22_23[Ano previsto para início],2023)","v":0},0,0]
["6.1 - Usos",{"$f":"SUMIFS(#REF!,#REF!,A26,#REF!,2021)","v":{"$error":"#REF!"}},{"$f":"SUMIFS(#REF!,#REF!,A26,#REF!,2021)","v":{"$error":"#REF!"}},{"$f":"SUMIFS(#REF!,#REF!,A26,#REF!,2021)","v":{"$error":"#REF!"}},{"$f":"SUMIFS(#REF!,#REF!,A26,#REF!,2021)","v":{"$error":"#REF!"}},{"$error":"#REF!"},null,"8.1 - Capacitação",{"$f":"SUMIFS(PAPI20_22_23[Recurso financeiro estimado no ano (R$) - CFURH],PAPI20_22_23[SubPDC],'Consolidaçao - 1'!H26,PAPI20_22_23[Ano previsto para início],2022)","v":0},{"$f":"SUMIFS(PAPI20_22_23[Recurso financeiro estimado no ano\n(R$) - Cobrança Estadual],PAPI20_22_23[SubPDC],'Consolidaçao - 1'!H26,PAPI20_22_23[Ano previsto para início],2022)","v":0},{"$f":"SUMIFS(PAPI20_22_23[Recurso financeiro estimado no ano\n(R$) - Cobrança Federal],PAPI20_22_23[SubPDC],'Consolidaçao - 1'!H26,PAPI20_22_23[Ano previsto para início],2022)","v":0},{"$f":"SUMIFS(PAPI20_22_23[Recurso financeiro estimado no ano (R$) - Outras],PAPI20_22_23[SubPDC],'Consolidaçao - 1'!H26,PAPI20_22_23[Ano previsto para início],2022)","v":0},0,{"$f":"SUMIFS(PAPI20_22_23[Recurso financeiro estimado no ano (R$) - CFURH],PAPI20_22_23[SubPDC],'Consolidaçao - 1'!H26,PAPI20_22_23[Ano previsto para início],2023)","v":0},{"$f":"SUMIFS(PAPI20_22_23[Recurso financeiro estimado no ano\n(R$) - Cobrança Estadual],PAPI20_22_23[SubPDC],'Consolidaçao - 1'!H26,PAPI20_22_23[Ano previsto para início],2023)","v":0},{"$f":"SUMIFS(PAPI20_22_23[Recurso financeiro estimado no ano\n(R$) - Cobrança Federal],PAPI20_22_23[SubPDC],'Consolidaçao - 1'!H26,PAPI20_22_23[Ano previsto para início],2023)","v":0},{"$f":"SUMIFS(PAPI20_22_23[Recurso financeiro estimado no ano (R$) - Outras],PAPI20_22_23[SubPDC],'Consolidaçao - 1'!H26,PAPI20_22_23[Ano previsto para início],2023)","v":0},0,0]
["6.2 - Segurança",{"$f":"SUMIFS(#REF!,#REF!,A27,#REF!,2021)","v":{"$error":"#REF!"}},{"$f":"SUMIFS(#REF!,#REF!,A27,#REF!,2021)","v":{"$error":"#REF!"}},{"$f":"SUMIFS(#REF!,#REF!,A27,#REF!,2021)","v":{"$error":"#REF!"}},{"$f":"SUMIFS(#REF!,#REF!,A27,#REF!,2021)","v":{"$error":"#REF!"}},{"$error":"#REF!"},null,"8.2 - Educação",{"$f":"SUMIFS(PAPI20_22_23[Recurso financeiro estimado no ano (R$) - CFURH],PAPI20_22_23[SubPDC],'Consolidaçao - 1'!H27,PAPI20_22_23[Ano previsto para início],2022)","v":0},{"$f":"SUMIFS(PAPI20_22_23[Recurso financeiro estimado no ano\n(R$) - Cobrança Estadual],PAPI20_22_23[SubPDC],'Consolidaçao - 1'!H27,PAPI20_22_23[Ano previsto para início],2022)","v":0},{"$f":"SUMIFS(PAPI20_22_23[Recurso financeiro estimado no ano\n(R$) - Cobrança Federal],PAPI20_22_23[SubPDC],'Consolidaçao - 1'!H27,PAPI20_22_23[Ano previsto para início],2022)","v":0},{"$f":"SUMIFS(PAPI20_22_23[Recurso financeiro estimado no ano (R$) - Outras],PAPI20_22_23[SubPDC],'Consolidaçao - 1'!H27,PAPI20_22_23[Ano previsto para início],2022)","v":0},0,{"$f":"SUMIFS(PAPI20_22_23[Recurso financeiro estimado no ano (R$) - CFURH],PAPI20_22_23[SubPDC],'Consolidaçao - 1'!H27,PAPI20_22_23[Ano previsto para início],2023)","v":0},{"$f":"SUMIFS(PAPI20_22_23[Recurso financeiro estimado no ano\n(R$) - Cobrança Estadual],PAPI20_22_23[SubPDC],'Consolidaçao - 1'!H27,PAPI20_22_23[Ano previsto para início],2023)","v":0},{"$f":"SUMIFS(PAPI20_22_23[Recurso financeiro estimado no ano\n(R$) - Cobrança Federal],PAPI20_22_23[SubPDC],'Consolidaçao - 1'!H27,PAPI20_22_23[Ano previsto para início],2023)","v":0},{"$f":"SUMIFS(PAPI20_22_23[Recurso financeiro estimado no ano (R$) - Outras],PAPI20_22_23[SubPDC],'Consolidaçao - 1'!H27,PAPI20_22_23[Ano previsto para início],2023)","v":0},0,0]
["6.3 - Aproveitamento",{"$f":"SUMIFS(#REF!,#REF!,A28,#REF!,2021)","v":{"$error":"#REF!"}},{"$f":"SUMIFS(#REF!,#REF!,A28,#REF!,2021)","v":{"$error":"#REF!"}},{"$f":"SUMIFS(#REF!,#REF!,A28,#REF!,2021)","v":{"$error":"#REF!"}},{"$f":"SUMIFS(#REF!,#REF!,A28,#REF!,2021)","v":{"$error":"#REF!"}},{"$error":"#REF!"},null,"8.3 - Comunicação",{"$f":"SUMIFS(PAPI20_22_23[Recurso financeiro estimado no ano (R$) - CFURH],PAPI20_22_23[SubPDC],'Consolidaçao - 1'!H28,PAPI20_22_23[Ano previsto para início],2022)","v":0},{"$f":"SUMIFS(PAPI20_22_23[Recurso financeiro estimado no ano\n(R$) - Cobrança Estadual],PAPI20_22_23[SubPDC],'Consolidaçao - 1'!H28,PAPI20_22_23[Ano previsto para início],2022)","v":0},{"$f":"SUMIFS(PAPI20_22_23[Recurso financeiro estimado no ano\n(R$) - Cobrança Federal],PAPI20_22_23[SubPDC],'Consolidaçao - 1'!H28,PAPI20_22_23[Ano previsto para início],2022)","v":0},{"$f":"SUMIFS(PAPI20_22_23[Recurso financeiro estimado no ano (R$) - Outras],PAPI20_22_23[SubPDC],'Consolidaçao - 1'!H28,PAPI20_22_23[Ano previsto para início],2022)","v":0},0,{"$f":"SUMIFS(PAPI20_22_23[Recurso financeiro estimado no ano (R$) - CFURH],PAPI20_22_23[SubPDC],'Consolidaçao - 1'!H28,PAPI20_22_23[Ano previsto para início],2023)","v":0},{"$f":"SUMIFS(PAPI20_22_23[Recurso financeiro estimado no ano\n(R$) - Cobrança Estadual],PAPI20_22_23[SubPDC],'Consolidaçao - 1'!H28,PAPI20_22_23[Ano previsto para início],2023)","v":0},{"$f":"SUMIFS(PAPI20_22_23[Recurso financeiro estimado no ano\n(R$) - Cobrança Federal],PAPI20_22_23[SubPDC],'Consolidaçao - 1'!H28,PAPI20_22_23[Ano previsto para início],2023)","v":0},{"$f":"SUMIFS(PAPI20_22_23[Recurso financeiro estimado no ano (R$) - Outras],PAPI20_22_23[SubPDC],'Consolidaçao - 1'!H28,PAPI20_22_23[Ano previsto para início],2023)","v":0},0,0]
["7.1 - Criticidades",{"$f":"SUMIFS(#REF!,#REF!,A29,#REF!,2021)","v":{"$error":"#REF!"}},{"$f":"SUMIFS(#REF!,#REF!,A29,#REF!,2021)","v":{"$error":"#REF!"}},{"$f":"SUMIFS(#REF!,#REF!,A29,#REF!,2021)","v":{"$error":"#REF!"}},{"$f":"SUMIFS(#REF!,#REF!,A29,#REF!,2021)","v":{"$error":"#REF!"}},{"$error":"#REF!"}]
["7.2 - Inundações",{"$f":"SUMIFS(#REF!,#REF!,A30,#REF!,2021)","v":{"$error":"#REF!"}},{"$f":"SUMIFS(#REF!,#REF!,A30,#REF!,2021)","v":{"$error":"#REF!"}},{"$f":"SUMIFS(#REF!,#REF!,A30,#REF!,2021)","v":{"$error":"#REF!"}},{"$f":"SUMIFS(#REF!,#REF!,A30,#REF!,2021)","v":{"$error":"#REF!"}},{"$error":"#REF!"},null,"Delib. 246","PDC 1 e 2","Prioritário","Não Prioritário"]
["7.3 - Estiagens",{"$f":"SUMIFS(#REF!,#REF!,A31,#REF!,2021)","v":{"$error":"#REF!"}},{"$f":"SUMIFS(#REF!,#REF!,A31,#REF!,2021)","v":{"$error":"#REF!"}},{"$f":"SUMIFS(#REF!,#REF!,A31,#REF!,2021)","v":{"$error":"#REF!"}},{"$f":"SUMIFS(#REF!,#REF!,A31,#REF!,2021)","v":{"$error":"#REF!"}},{"$error":"#REF!"},null,"SubPDC",{"$f":"SUMIF(#REF!,I$30,PAPI20_22_23[Recurso financeiro estimado no ano\n(R$)])","v":{"$error":"#REF!"}},{"$f":"SUMIF(#REF!,J$30,PAPI20_22_23[Recurso financeiro estimado no ano\n(R$)])","v":{"$error":"#REF!"}},{"$f":"SUMIF(#REF!,K$30,PAPI20_22_23[Recurso financeiro estimado no ano\n(R$)])","v":{"$error":"#REF!"}}]
["8.1 - Capacitação",{"$f":"SUMIFS(#REF!,#REF!,A32,#REF!,2021)","v":{"$error":"#REF!"}},{"$f":"SUMIFS(#REF!,#REF!,A32,#REF!,2021)","v":{"$error":"#REF!"}},{"$f":"SUMIFS(#REF!,#REF!,A32,#REF!,2021)","v":{"$error":"#REF!"}},{"$f":"SUMIFS(#REF!,#REF!,A32,#REF!,2021)","v":{"$error":"#REF!"}},{"$error":"#REF!"},null,null,{"$f":"IFERROR(I31/SUM(I31:K31),\"\")","v":""},{"$f":"IFERROR(J31/SUM(I31:K31),\"\")","v":""},{"$f":"IFERROR(K31/SUM(I31:K31),\"\")","v":""}]
["8.2 - Educação",{"$f":"SUMIFS(#REF!,#REF!,A33,#REF!,2021)","v":{"$error":"#REF!"}},{"$f":"SUMIFS(#REF!,#REF!,A33,#REF!,2021)","v":{"$error":"#REF!"}},{"$f":"SUMIFS(#REF!,#REF!,A33,#REF!,2021)","v":{"$error":"#REF!"}},{"$f":"SUMIFS(#REF!,#REF!,A33,#REF!,2021)","v":{"$error":"#REF!"}},{"$error":"#REF!"}]
["8.3 - Comunicação",{"$f":"SUMIFS(#REF!,#REF!,A34,#REF!,2021)","v":{"$error":"#REF!"}},{"$f":"SUMIFS(#REF!,#REF!,A34,#REF!,2021)","v":{"$error":"#REF!"}},{"$f":"SUMIFS(#REF!,#REF!,A34,#REF!,2021)","v":{"$error":"#REF!"}},{"$f":"SUMIFS(#REF!,#REF!,A34,#REF!,2021)","v":{"$error":"#REF!"}},{"$error":"#REF!"}]
[]
["Delib. 190","PDC 1 e 2","Prioritário","Não Prioritário"]
["SubPDC",{"$f":"SUMIF(#REF!,B$36,#REF!)","v":{"$error":"#REF!"}},{"$f":"SUMIF(#REF!,C$36,#REF!)","v":{"$error":"#REF!"}},{"$f":"SUMIF(#REF!,D$36,#REF!)","v":{"$error":"#REF!"}}]
[null,{"$f":"B37/SUM(B37:D37)","v":{"$error":"#REF!"}},{"$f":"C37/SUM(B37:D37)","v":{"$error":"#REF!"}},{"$f":"D37/SUM(B37:D37)","v":{"$error":"#REF!"}}]

{"sheet":"Consolidaçao - 2","index":6,"n_rows":2,"n_cols":1,"rows_kept":2,"cut":false,"hidden":true,"merged":[]}
["Para atualizar, vá em Dados --> Atualizar Tudo ou aperte"]
["CTRL + Alt + F5"]

{"sheet":"Orientações","index":7,"n_rows":17,"n_cols":3,"rows_kept":17,"cut":false,"hidden":false,"merged":[]}
[null,null,"MELHOR VISUALIZADO no Office 365"]
[]
[null,null,"Este modelo de PAPI para o quadriênio 2024-2027 tem uma estrutura distinta dos enviados nos outros períodos/anos, pois ele contempla tanto o PAPI 24-27 e seu acompanhamento, quanto o acompanhamento do PAPI anterior."]
[null,null,"Está dividido em multiplas  planilhas (\"abas\"), estruturadas em dois grupos: PAPI 24-27 e PAPI 20-23 (Acompanhamento). A expectativa é que a mesma planilha sirva para todo o quadriênio."]
[]
[]
[]
[null,"A","PAPI 2024-2027"]
[null,null,"Compreende quatro planilhas (\"abas\") e se refere ao planejamento e acompanhamento do PAPI - 24-27. "]
[null,1,"Identificação das ações - 24-27\" - Compreende a indicação das ações previstas para o PAPI 2024-2027. Sugere-se a indicação do que será produzido/realizado com o recurso pleiteado, considerando a esfera de atuação direta do CBH. Envolve um fluxo de atividades a serem executadas para entregar um produto final. Preencher TODAS  informações das colunas também de forma sequencial (esquerda para direita)."]
[null,2,"Acompanhamento das metas 24-27 - Compreende a indicação e o acompanhamento da execução das Metas (do quadriênio e anuais).Devem ser quantificáveis e mensuráveis por meio de indicadores que reflitam as mudanças para as quais espera-se que as intervenções previstos pelas ações propostas influenciem."]
[null,3,"Acomp. Financeiro  24-27  -  Acompanhamento das previsões dos valores (R$) planejados, disponbilizados e executados. Para esta primeira etapa, só precisam ser preenchidos os valores Planejados (colunas em roxo). O acompanhamento se dará ao longo do quadriênio."]
[null,4,"PAPI 2024-2027 - Resultado automático do preenchimento anterior. Somente as ações sem recursos financeiros previstos deve ser preenchida. As demais são inseridas automaticamente. É o conteúdo mínimo do PAPI 24/27 que deve ser deliberado e referendado nas revisões anuais."]
[]
[null,"B","ACOMPANHAMENTO -  PAPI 20-23"]
[null,null,"Compreende o acompanhamento das ações iniciadas no quadriênio anterior. Como grande parte delas ainda está em execução,  ideal é monitorar, na medida do possível, sua execução."]
[null,1,"Serão utilizadas as mesmas planilhas do ano anterior, que devem ser incorporadas no presente arquivo. Observar as duas colunas na cor roxa, relativa ao acompanhamento 2024. As outras colunas devem ser copiadas do último PAPI aprovado. Como se trata do acompanhamento de 2024 dessas ações, só será iniciado em 2025."]

{"sheet":"Acomp. - PAPI_21 (Delib. 190) ","index":8,"n_rows":134,"n_cols":12,"rows_kept":134,"cut":false,"hidden":true,"merged":[]}
["ID Ação","Ano","SubPDC","Prioridade do SubPDC","Ação","Meta","% Execução da meta","Segmento do executor","Área de abrangência","Nome da área de abrangência","Recurso financeiro executado no ano (R$)","Justificativa sobre execução física e financeira em 2024"]
["PCJ3.3.1.2/2021",2021,"1.2 - Planejamento","PDC 1 e 2","Fomento à Planos Municipais de Saneamento Rural","15 Planos Municipais de Saneamento Rural elaborados",0.3,"Município","Bacia","Bacias PCJ, observando os municípios e ACs prioritários para saneamento rural",1383949.22,"Os investimentos previstos para serem financiados por outras fontes, que não estão sobre a governança da Agências das Bacias PCJ, não possuem mecanismo de acompanhamento sobre a sua execução físico-financeira."]
["PCJ3.3.1.2/2021",2021,"1.2 - Planejamento","PDC 1 e 2","Fomento à Planos Municipais de Saneamento Rural","15 Planos Municipais de Saneamento Rural elaborados",0.35,"Município","Bacia","Bacias PCJ, observando os municípios e ACs prioritários para saneamento rural",555502.43000000005,"Idem ação nº PCJ3.3.1.2/2021"]
["PCJ1.2.1.7/2021",2021,"1.2 - Planejamento","PDC 1 e 2","Elaboração e revisão de planos municipais de saneamento básico","Ao menos 05 planos revisados/elaborados",0.3,"Município","Município","A definir",1254346.47,"Idem ação nº PCJ3.3.1.2/2021"]
["PCJ2.3.2.1/2021",2021,"1.2 - Planejamento","PDC 1 e 2","Elaboração e revisão de Planos de Controle e Redução de Perdas","Ao menos 05 planos revisados/elaborados",0.4,"Município","Município","Municípios observando as prioridades no Plano de Bacias",2383777.0299999998,"Idem ação nº PCJ3.3.1.2/2021"]
["PCJ6.2.3.1/2021",2021,"1.4 - Monitoramento","PDC 1 e 2","Expansão, integração, operação e manutenção da rede de monitoramento quali-quantitativo dos recursos hídricos","Disponibilização dos dados de ao menos 36 postos ativos e contratação de 01 estudo de monitoramento qualitativo",0.15,"Sociedade civil","Bacia","Bacias PCJ",1231928.02,"Idem ação nº PCJ3.3.1.2/2021"]
["PCJ3.3.1.1/2021",2021,"3.1 - Efluentes","Prioritário","Substituição de sistemas rudimentares de tratamento de esgoto (fossa negra) por sistemas mais eficientes","Substituição de 30 sistemas",0.3,"Município","Município","Município",520210.3,"Idem ação nº PCJ3.3.1.2/2021"]
["PCJ2.1.1.1/2021",2021,"1.1 - SI","PDC 1 e 2","Manutenção e aprimoramento de um modelo chuva-vazão para as Bacias PCJ","Disponibilidade de ao menos 01 modelo",1,"Sociedade civil","Bacia","Bacias PCJ",435000]
["PCJ2.1.1.1/2021",2021,"1.1 - SI","PDC 1 e 2","Manutenção e aprimoramento de um modelo chuva-vazão para as Bacias PCJ","Disponibilidade de ao menos 01 modelo",0,"Sociedade civil","Bacia","Bacias PCJ"]
["PCJ1.1.1.2/2021",2021,"1.2 - Planejamento","PDC 1 e 2","Elaboração de estudos para ampliação e melhoria dos sistemas de transporte de esgotos","Elaboração de ao menos 01 estudo",0,"Município","Bacia","Municípios com prioridades para coleta, no Plano de Bacias",2461459.23,"Os investimentos previstos para serem financiados por outras fontes, que não estão sobre a governança da Agências das Bacias PCJ, não possuem mecanismo de acompanhamento sobre a sua execução físico-financeira"]
["PCJ1.1.1.1/2021",2021,"1.2 - Planejamento","PDC 1 e 2","Elaboração de estudos para ampliação e melhoria dos sistemas de coleta de esgotos","Elaboração de ao menos 01 estudo",0,"Município","Bacia","Municípios com prioridades para coleta, no Plano de Bacias",null,"Idem ação nº PCJ1.1.1.2/2021"]
["PCJ1.1.2.2/2021",2021,"1.2 - Planejamento","PDC 1 e 2","Elaboração de estudos para a implantação de novas ETEs visando tratamento secundário","Elaboração de ao menos 01 estudo",0,"Município","Município","Municípios observando as prioridades para tratamento secundário, no Plano de Bacias",679913.98,"Idem ação nº PCJ1.1.1.2/2021"]
["PCJ1.2.1.1/2021",2021,"1.2 - Planejamento","PDC 1 e 2","Elaboração de estudos de melhorias da eficiência das ETEs na remoção de nutrientes","Elaboração de ao menos 01 estudo",0,"Município","Município","Municípios observando as prioridades para remoção de nitrogênio e fósforo, no Plano de Bacias",3602522.4,"Idem ação nº PCJ1.1.1.2/2021"]
["PCJ2.2.2.1/2021",2021,"1.2 - Planejamento","PDC 1 e 2","Desenvolvimento de estudos de alternativas e intervenções para minimização dos riscos de inundação ribeirinha","Planos elaborados por sub-bacia e intervenções realizadas",0.45,"Sociedade civil","Bacia","Bacias PCJ",2350000]
["PCJ1.2.1.7/2021",2021,"1.2 - Planejamento","PDC 1 e 2","Elaboração e revisão de planos municipais de saneamento básico","Ao menos 01 plano revisado/elaborado",0.15,"Sociedade civil","Município","A definir",0,"Idem ação nº PCJ1.1.1.2/2021"]
["PCJ2.2.1.1/2021",2021,"1.5 - Disponibilidade","PDC 1 e 2","Elaboração do plano diretor de reúso de água para as Bacias PCJ","01 Plano elaborado",0.15,"Sociedade civil","Bacia","Bacias PCJ",null,"Idem ação nº PCJ1.1.1.2/2021"]
["PCJ6.2.4.1/2021",2021,"1.3 - Enquadramento","PDC 1 e 2","Encaminhamento do enquadramento da porção mineira das Bacias PCJ","Encaminhamento de uma proposta de enquadramento ao CERH-MG",0,"Sociedade civil","Sub-bacia","Porção Mineira das Bacias PCJ",null,"Os investimentos previstos para serem financiados por outras fontes, que não estão sobre a governança da Agências das Bacias PCJ, não possuem mecanismo de acompanhamento sobre a sua execução físico-financeira"]
["PCJ6.2.3.1/2021",2021,"1.4 - Monitoramento","PDC 1 e 2","Expansão, integração, operação e manutenção da rede de monitoramento quali-quantitativo dos recursos hídricos","Disponibilização dos dados de ao menos 36 postos ativos",0.6,"Sociedade civil","Bacia","Bacias PCJ",2290000]
["PCJ6.1.1.2/2021",2021,"2.3 - Cobrança","PDC 1 e 2","Apoio operacional para a área de cobrança pelo uso dos recursos hídricos","Apoio operacional contínuo",0.9,"Sociedade civil","Bacia","Bacias PCJ",1210000]
["PCJ6.2.1.1/2021",2021,"1.6 - Legislação","PDC 1 e 2","Estudos para aprimoramento da cobrança pelo uso dos recursos hídricos","Ao menos 01 estudo elaborado",0.15,"Sociedade civil","Bacia","Bacias PCJ",null,"Idem ação nº PCJ6.2.4.1/2021"]
["PCJ6.1.1.5/2021",2021,"2.5 - Integração","PDC 1 e 2","Apoio operacional para acompanhamento de projetos da área de Sistema de Informações","Apoio operacional contínuo",0.9,"Sociedade civil","Bacia","Bacias PCJ",1450000]
["PCJ6.2.5.3/2021",2021,"2.5 - Integração","PDC 1 e 2","Apoio operacional para fiscalização de outorgas","Apoio operacional contínuo",0.15,"Sociedade civil","Bacia","Bacias PCJ",null,"Idem ação nº PCJ6.2.4.1/2021"]
["PCJ6.1.1.4/2021",2021,"2.5 - Integração","PDC 1 e 2","Apoio Operacional para acompanhamento de empreendimentos de demanda espontânea","Apoio operacional contínuo",0.9,"Sociedade civil","Bacia","Bacias PCJ",1350000]
["PCJ6.1.2.2/2021",2021,"2.5 - Integração","PDC 1 e 2","Remuneração de agentes técnicos e financeiros para empreendimentos deliberados pelos Comitês PCJ","Desembolso de ao menos 60% do valor previsto",0.3,"Sociedade civil","Bacia","Bacias PCJ",300000]
["PCJ6.1.2.1/2021",2021,"2.5 - Integração","PDC 1 e 2","Apoio operacional para a Secretaria Executiva dos Comitês PCJ","Apoio operacional contínuo",0.9,"Sociedade civil","Bacia","Bacias PCJ",800000]
["PCJ6.1.1.3/2021",2021,"2.5 - Integração","PDC 1 e 2","Apoio operacional para acompanhamento de projetos de assessoria ambiental","Apoio operacional contínuo",0.9,"Sociedade civil","Bacia","Bacias PCJ",891000]
["PCJ6.1.1.1/2021",2021,"2.5 - Integração","PDC 1 e 2","Apoio operacional para a Área de Tecnologia da Informação - TI","Apoio operacional contínuo",0.9,"Sociedade civil","Bacia","Bacias PCJ",850000]
["PCJ6.1.2.3/2021",2021,"2.5 - Integração","PDC 1 e 2","Logística de Suporte às reuniões Plenárias e das CTs dos Comitês PCJ","Apoio operacional contínuo",0.9,"Sociedade civil","Bacia","Bacias PCJ",200000]
["PCJ6.1.2.5/2021",2021,"2.5 - Integração","PDC 1 e 2","Manutenção de licenciamento de sistemas de TI","Apoio operacional contínuo",0.75,"Sociedade civil","Bacia","Bacias PCJ",500000]
["PCJ6.1.2.4/2021",2021,"2.5 - Integração","PDC 1 e 2","Participação de membros dos Comitês PCJ em eventos internos das CTs e eventos externos","Desembolso de ao menos 70% do valor previsto",0.15,"Sociedade civil","Bacia","Bacias PCJ",200000]
["PCJ6.1.1.7/2021",2021,"2.5 - Integração","PDC 1 e 2","Apoio operacional para acompanhamento de ações da porção mineira","Apoio operacional contínuo",0,"Sociedade civil","Bacia","Bacias PCJ",null,"Os investimentos previstos para serem financiados por outras fontes, que não estão sobre a governança da Agências das Bacias PCJ, não possuem mecanismo de acompanhamento sobre a sua execução físico-financeira"]
["PCJ1.2.1.5/2021",2021,"1.1 - SI","PDC 1 e 2","Cadastro, caracterização e modelagem de cargas industriais","Ao menos 01 estudo realizado",0,"Sociedade civil","Bacia","Bacias PCJ"]
["PCJ4.1.1.2/2021",2021,"1.1 - SI","PDC 1 e 2","Desenvolvimento de banco de dados de poços e suporte à decisão","Ao menos 01 banco de dados",0,"A definir","Bacia","Bacias PCJ"]
["PCJ6.2.2.1/2021",2021,"1.1 - SI","PDC 1 e 2","Manutenção e aprimoramentos do SSD PCJ","Publicação de ao menos uma interface revisada",0,"Sociedade civil","Bacia","Bacias PCJ"]
["PCJ6.3.1.5/2021",2021,"1.2 - Planejamento","PDC 1 e 2","Elaborar Plano de Comunicação quando de operações emergenciais das barragens","Contratação de 01 estudo para orientar a elaboração de Plano de Comunicação",0,"Sociedade civil","Bacia","Bacias PCJ",null,"Idem ação n° PCJ6.1.1.7/2021"]
["PCJ6.3.1.7/2021",2021,"1.2 - Planejamento","PDC 1 e 2","Promover a compatibilidade entre os planos de cada UGRHI","Contratação de 01 estudo sobre a compatibilização dos planos de bacia hidrográfica dos CBHs da Bacia do Rio Tietê",0,"Sociedade civil","Bacia","Bacias PCJ"]
["PCJ1.1.2.4/2021",2021,"1.2 - Planejamento","PDC 1 e 2","Elaboração de estudos e relatórios visando o licenciamento das ETEs projetadas","Elaboração de ao menos 01 estudo",0,"A definir","Município","A definir",null,"Os investimentos previstos para serem financiados por outras fontes, que não estão sobre a governança da Agências das Bacias PCJ, não possuem mecanismo de acompanhamento sobre a sua execução físico-financeira"]
["PCJ2.3.3.2/2021",2021,"1.2 - Planejamento","PDC 1 e 2","Elaboração dos Planos Diretores de Drenagem Urbana e Manejo de Águas Pluviais","Elaboração de ao menos 01 Plano, considerando os trechos vulneráveis indicados no Plano de Bacias",0,"Município","Município","Municípios observando as prioridades no Plano de Bacias",null,"Idem ação n° PCJ1.1.2.4/2021"]
["PCJ2.3.3.2/2021",2021,"1.2 - Planejamento","PDC 1 e 2","Elaboração dos Planos Diretores de Drenagem Urbana e Manejo de Águas Pluviais","Elaboração de ao menos 01 Plano, considerando os trechos vulneráveis indicados no Plano de Bacias",0,"Município","Município","Municípios observando as prioridades no Plano de Bacias",null,"Idem ação n° PCJ1.1.2.4/2021"]
["PCJ4.3.2.1/2021",2021,"1.2 - Planejamento","PDC 1 e 2","Realizar os procedimentos estabelecidos para as áreas de restrição e controle já identificadas nas Bacias PCJ e avaliar a existência de novas áreas","Ao menos 01 estudo elaborado",0,"Sociedade civil","Bacia","Bacias PCJ",null,"Idem ação n° PCJ1.1.2.4/2021"]
["PCJ6.2.3.3/2021",2021,"1.4 - Monitoramento","PDC 1 e 2","Implantação, integração, operação e manutenção da rede de monitoramento quali-quantitativo das águas subterrâneas","Disponibilização dos dados de ao menos 02 postos ativos",0,"A definir","Bacia","Bacias PCJ",null,"Idem ação n° PCJ1.1.2.4/2021"]
["PCJ2.2.4.1/2021",2021,"1.5 - Disponibilidade","PDC 1 e 2","Desenvolvimento de estudo de alternativas de aumento da disponibilidade hídrica nas sub-bacias dos rios Atibaia, Jundiaí e Capivari","Ao menos 01 estudo elaborado",0,"Sociedade civil","Sub-bacia","Sub-bacias Atibaia, Jundiaí e Capivari",null,"Idem ação n° PCJ1.1.2.4/2021"]
["PCJ6.1.2.6/2021",2021,"2.5 - Integração","PDC 1 e 2","Eventos especiais dos Comitês PCJ","Participação em ao menos 01 evento",0,"Sociedade civil","Bacia","Bacias PCJ",null,"Os investimentos previstos para serem financiados por outras fontes, que não estão sobre a governança da Agências das Bacias PCJ, não possuem mecanismo de acompanhamento sobre a sua execução físico-financeira"]
["PCJ6.2.6.1/2021",2021,"2.5 - Integração","PDC 1 e 2","Apoio operacional para gerenciamento da implementação e da revisão do Plano de Bacias","Contratação de ao menos 01 pessoa",0,"Sociedade civil","Bacia","Bacias PCJ",null,"Idem ação nº PCJ6.1.2.6/2021"]
["PCJ1.1.2.3/2021",2021,"3.1 - Efluentes","Prioritário","Elaboração de projetos para a implantação de novas ETEs visando tratamento secundário","Elaboração de ao menos 01 projeto",0,"Município","Município","Municípios observando as prioridades para tratamento secundário, no Plano de Bacias",null,"Idem ação nº PCJ6.1.2.6/2021"]
["PCJ1.1.2.3/2021",2021,"3.1 - Efluentes","Prioritário","Elaboração de projetos para a implantação de novas ETEs visando tratamento secundário","Elaboração de ao menos 01 projeto",0,"Município","Município","Municípios observando as prioridades para tratamento secundário, no Plano de Bacias",3602522.4,"Idem ação nº PCJ6.1.2.6/2021"]
["PCJ1.2.1.2/2021",2021,"3.1 - Efluentes","Prioritário","Elaboração de projetos de melhorias da eficiência das ETEs na remoção de nutrientes","Elaboração de ao menos 01 projeto",0,"Município","Município","Municípios observando as prioridades para remoção de nitrogênio e fósforo, no Plano de Bacias",20414293.600000001,"Idem ação nº PCJ6.1.2.6/2021"]
["PCJ1.2.1.2/2021",2021,"3.1 - Efluentes","Prioritário","Elaboração de projetos de melhorias da eficiência das ETEs na remoção de nutrientes","Elaboração de ao menos 01 projeto",0,"Município","Município","Municípios observando as prioridades para remoção de nitrogênio e fósforo, no Plano de Bacias",null,"Idem ação nº PCJ6.1.2.6/2021"]
["PCJ1.2.1.8/2021",2021,"3.1 - Efluentes","Prioritário","Implantação de Unidades de Tratamento de Lodo nas ETAs","Ao menos 01 projeto realizado",0,"Município","Município","A definir",1500000,"Idem ação nº PCJ6.1.2.6/2021"]
["PCJ1.1.1.5/2021",2021,"3.1 - Efluentes","Prioritário","Ampliações e melhoria dos sistemas de coleta de esgotos","Ampliação dos sistemas de coleta de esgotos de pelo menos 20% dos municípios prioritários",0,"Município","Município","Municípios observando as prioridades no Plano de Bacias",196916738.44,"Os investimentos previstos para serem financiados por outras fontes, que não estão sobre a governança da Agências das Bacias PCJ, não possuem mecanismo de acompanhamento sobre a sua execução físico-financeira"]
["PCJ1.1.2.5/2021",2021,"3.1 - Efluentes","Prioritário","Implantação das ETEs projetadas e melhorias das ETEs existentes","Ao menos 01 ETE implantada",0,"Município","Bacia","Bacias PCJ, observando as prioridades para tratamento secundário.",20497153.010000002,"Idem ação nº PCJ1.1.1.5/2021"]
["PCJ2.3.1.1/2021",2021,"1.2 - Planejamento","Prioritário","Estudos de viabilidade para aumento de regularização de vazões em mananciais existentes e novos barramentos","Ao menos 01 plano revisado/elaborado",0,"Sociedade Civil","Bacia","Bacias PCJ",null,"Idem ação nº PCJ1.1.1.5/2021"]
["PCJ5.4.1.1/2021",2021,"1.2 - Planejamento","Prioritário","Construção de propostas para a recuperação, conservação e proteção dos recursos hídricos em áreas rurais","Ao menos 01 proposta",0,"Sociedade Civil","Bacia","Bacias PCJ",null,"Idem ação nº PCJ1.1.1.5/2021"]
["PCJ1.1.2.1/2021",2021,"3.1 - Efluentes","Prioritário","Melhoria e recuperação da qualidade das águas","Alcance das metas intermediárias dos cenários de referência para planejamento, conforme descrito no Plano de Bacias",0,"Município","Município","Municípios prioritários indicados na Deliberação dos Comitês PCJ nº 324/2019",null,"Idem ação nº PCJ1.1.1.5/2021"]
["PCJ1.1.1.3/2021",2021,"3.1 - Efluentes","Prioritário","Elaboração de projetos de ampliação e melhoria dos sistemas de coleta de esgotos","Elaboração de ao menos 01 projeto",0,"Município","Município","Municípios prioritários indicados na Deliberação dos Comitês PCJ nº 324/2019",null,"Idem ação nº PCJ1.1.1.5/2021"]
["PCJ2.3.2.2/2021",2021,"5.1 - Perdas","Prioritário","Controle de perdas em sistemas de abastecimento de água","Alcance das metas intermediárias dos cenários de referência para planejamento, conforme descrito do Plano de Bacias",0,"Município","Município","Municípios observando as prioridades do Plano de Bacias",1000000,"Idem ação nº PCJ3.2.1.1/2021financeira"]
["PCJ2.3.2.2/2021",2021,"5.1 - Perdas","Prioritário","Controle de perdas em sistemas de abastecimento de água","Alcance das metas intermediárias dos cenários de referência para planejamento, conforme descrito do Plano de Bacias",0,"Município","Município","Para 2020, municípios prioritários indicados na Deliberação dos Comitês PCJ nº 324/2019. A partir de 2021, municípios observando as prioridades do Plano de Bacias",null,"Os investimentos previstos para serem financiados por outras fontes, que não estão sobre a governança da Agências das Bacias PCJ, não possuem mecanismo de acompanhamento sobre a sua execução físico-financeira"]
["PCJ2.3.2.3/2021",2021,"5.1 - Perdas","Prioritário","Manutenção do projeto de benchmarking para o controle de perdas de água em sistemas de distribuição","Ao menos 01 manutenção realizada",0,"Sociedade civil","Bacia","Bacias PCJ",null,"Idem ação nº PCJ2.3.2.2/2021"]
["PCJ3.1.2.5/2021",2021,"4.1 - Mananciais","Não prioritário","Estabilização de voçorocas nas propriedades que receberão projetos de recomposição florestal","Estabilização de 10 voçorocas/ano nas propriedades que recebem projetos de recomposição florestal",0,"A definir","Bacia","Áreas de Contribuição das Bacias PCJ prioritárias conforme mapa síntese, Mapa Conservação, recuperação de nascentes, matas ciliares e áreas de recarga do Plano de Bacias",100000,"Idem ação nº PCJ2.3.2.2/2021"]
["PCJ3.1.2.6/2021",2021,"4.1 - Mananciais","Não prioritário","Aplicação de técnicas de conservação do solo em propriedades que receberão os projetos de recomposição florestal","Aplicação de técnicas de conservação do solo em aproximadamente 360 ha/ano",0,"A definir","Bacia","Áreas de Contribuição das Bacias PCJ prioritárias conforme mapa síntese, Mapa Conservação, recuperação de nascentes, matas ciliares e áreas de recarga do Plano de Bacias",500000,"Idem ação nº PCJ2.3.2.2/2021"]
["PCJ3.2.1.1/2021",2021,"4.1 - Mananciais","Não prioritário","Execução de intervenções de conservação de solo","Conservação de solo em 300 hectares por ano",0,"A definir","Bacia","Áreas de Contribuição das Bacias PCJ prioritárias conforme mapa síntese, Mapa Conservação, recuperação de nascentes, matas ciliares e áreas de recarga do Plano de Bacias",391950,"Idem ação nº PCJ2.3.2.2/2021"]
["PCJ3.1.3.1/2021",2021,"4.1 - Mananciais","Não prioritário","Implementação de projetos de PSA","Contratação de ao menos 01 projeto aprovado no Edital anualmente",0.9,"Município","Bacia","Áreas de Contribuição das Bacias PCJ prioritárias conforme mapa síntese, Mapa Conservação, recuperação de nascentes, matas ciliares e áreas de recarga do Plano de Bacias",null,"Os investimentos previstos para serem financiados por outras fontes, que não estão sobre a governança da Agências das Bacias PCJ, não possuem mecanismo de acompanhamento sobre a sua execução físico-financeira"]
["PCJ3.1.3.1/2021",2021,"4.1 - Mananciais","Não prioritário","Implementação de projetos de PSA","Contratação de ao menos 01 projeto aprovado no Edital anualmente",0,"Município","Bacia","Áreas de Contribuição das Bacias PCJ prioritárias conforme mapa síntese, Mapa Conservação, recuperação de nascentes, matas ciliares e áreas de recarga do Plano de Bacias",null,"Idem ação nº PCJ3.1.3.1/2021"]
["PCJ3.1.2.1/2021",2021,"4.2 - Vegetação","Não prioritário","Promoção da conservação e recuperação de nascentes, matas ciliares e áreas de recarga","Recuperação de 10 hectares de áreas prioritárias por ano",0,"A definir","Bacia","Áreas de Contribuição das Bacias PCJ prioritárias conforme mapa síntese, Mapa Conservação, recuperação de nascentes, matas ciliares e áreas de recarga do Plano de Bacias",200000]
["PCJ3.1.1.1/2021",2021,"4.1 - Mananciais","Não prioritário","Desenvolvimento e monitoramento da implementação dos PIPs","Contratação da elaboração de PIPs para 1.000 hectares por ano",0,"A definir","Bacia","Bacias PCJ",null,"Idem ação nº PCJ3.1.3.1/2021"]
["PCJ3.1.2.1/2021",2021,"4.2 - Vegetação","Não prioritário","Promoção da conservação e recuperação de nascentes, matas ciliares e áreas de recarga","Recuperação de 40 hectares de áreas prioritárias por ano",0,"A definir","Bacia","Áreas de Contribuição das Bacias PCJ prioritárias conforme mapa síntese, Mapa Conservação, recuperação de nascentes, matas ciliares e áreas de recarga do Plano de Bacias",469003.24,"Idem ação nº PCJ3.1.3.1/2021"]
["PCJ3.1.2.1/2021",2021,"4.2 - Vegetação","Não prioritário","Promoção da conservação e recuperação de nascentes, matas ciliares e áreas de recarga","Recuperação de 40 hectares de áreas prioritárias por ano",0,"Município","Bacia","Áreas de Contribuição das Bacias PCJ prioritárias conforme mapa síntese, Mapa Conservação, recuperação de nascentes, matas ciliares e áreas de recarga do Plano de Bacias",null,"Os investimentos previstos para serem financiados por outras fontes, que não estão sobre a governança da Agências das Bacias PCJ, não possuem mecanismo de acompanhamento sobre a sua execução físico-financeira"]
["PCJ5.3.1.2/2021",2021,"8.1 - Capacitação","Não prioritário","Elaboração de um Plano de Capacitação Técnica e realização de processos formativos nas áreas de atuação das Câmaras Técnicas","01 Plano elaborado e ao menos 12 membros capacitados em nível de pós-graduação",1,"Sociedade civil","Bacia","Bacias PCJ",165000]
["PCJ1.4.1.2/2021",2021,"8.1 - Capacitação","Não prioritário","Ampliação e divulgação do programa de capacitação (Escola da Água e Saneamento), fomento e incentivo à capacitação de operadores","Capacitação de ao menos 05 turmas por ano",0.15,"Sociedade civil","Bacia","Bacias PCJ",null,"Idem ação nº PCJ3.1.2.1/2021"]
["PCJ5.2.1.2/2021",2021,"8.3 - Comunicação","Não prioritário","Realização de processos formativos e campanhas educativas sobre a realidade das Bacias PCJ","Ao menos 01 processo formativo e uma campanha educativa realizada",0.15,"Sociedade civil","Bacia","Bacias PCJ",null,"Idem ação nº PCJ3.1.2.1/2021"]
["PCJ5.1.1.1/2021",2021,"8.3 - Comunicação","Não prioritário","Elaboração e execução de um Plano de Comunicação para o fortalecimento da comunicação entre a sociedade civil e os Comitês PCJ","01 Plano elaborado e ações implementadas",1,"Sociedade civil","Bacia","Bacias PCJ",50000]
["PCJ3.1.2.4/2021",2021,"8.3 - Comunicação","Não prioritário","Fomento à elaboração de planos integrados de recomposição florestal e proteção dos biomas Mata Atlântica e Cerrado","Capacitar os municípios para o desenvolvimento dos Planos",0,"Sociedade civil","Bacia","Bacias PCJ",null,"Idem ação nº PCJ3.1.2.1/2021"]
["PCJ6.1.1.6/2021",2021,"8.3 - Comunicação","Não prioritário","Apoio operacional para a área de comunicação social","Apoio operacional contínuo",0.75,"Sociedade civil","Bacia","Bacias PCJ",610000]
["PCJ3.1.2.4/2021",2021,"8.3 - Comunicação","Não prioritário","Fomento à elaboração de planos integrados de recomposição florestal e proteção dos biomas Mata Atlântica e Cerrado","Capacitar os municípios para o desenvolvimento dos Planos",null,"Sociedade civil","Bacia","Bacias PCJ",{"$f":"IF(SUM([1]!PAPI20_21[[#This Row],[Recurso financeiro estimado no ano\n(R$) - Cobrança Estadual]:[Recurso financeiro estimado no ano (R$) - Outras]]) =0, \"\",SUM([1]!PAPI20_21[[#This Row],[Recurso financeiro estimado no ano\n(R$) - Cobrança Estadual]:[Recurso financeiro estimado no ano (R$) - Outras]]))","v":""},"Os investimentos previstos para serem financiados por outras fontes, que não estão sobre a governança da Agências das Bacias PCJ, não possuem mecanismo de acompanhamento sobre a sua execução físico-financeira"]
["PCJ6.1.1.6/2021",2021,"8.3 - Comunicação","Não prioritário","Apoio operacional para a área de comunicação social","Apoio operacional contínuo",0.75,"Sociedade civil","Bacia","Bacias PCJ",{"$f":"IF(SUM([1]!PAPI20_21[[#This Row],[Recurso financeiro estimado no ano\n(R$) - Cobrança Estadual]:[Recurso financeiro estimado no ano (R$) - Outras]]) =0, \"\",SUM([1]!PAPI20_21[[#This Row],[Recurso financeiro estimado no ano\n(R$) - Cobrança Estadual]:[Recurso financeiro estimado no ano (R$) - Outras]]))","v":610000}]
[null,null,null,null,null,null,null,null,null,null,{"$f":"IF(SUM([1]!PAPI20_21[[#This Row],[Recurso financeiro estimado no ano\n(R$) - Cobrança Estadual]:[Recurso financeiro estimado no ano (R$) - Outras]]) =0, \"\",SUM([1]!PAPI20_21[[#This Row],[Recurso financeiro estimado no ano\n(R$) - Cobrança Estadual]:[Recurso financeiro estimado no ano (R$) - Outras]]))","v":""}]
[null,null,null,null,null,null,null,null,null,null,{"$f":"IF(SUM([1]!PAPI20_21[[#This Row],[Recurso financeiro estimado no ano\n(R$) - Cobrança Estadual]:[Recurso financeiro estimado no ano (R$) - Outras]]) =0, \"\",SUM([1]!PAPI20_21[[#This Row],[Recurso financeiro estimado no ano\n(R$) - Cobrança Estadual]:[Recurso financeiro estimado no ano (R$) - Outras]]))","v":""}]
[null,null,null,null,null,null,null,null,null,null,{"$f":"IF(SUM([1]!PAPI20_21[[#This Row],[Recurso financeiro estimado no ano\n(R$) - Cobrança Estadual]:[Recurso financeiro estimado no ano (R$) - Outras]]) =0, \"\",SUM([1]!PAPI20_21[[#This Row],[Recurso financeiro estimado no ano\n(R$) - Cobrança Estadual]:[Recurso financeiro estimado no ano (R$) - Outras]]))","v":""}]
[null,null,null,null,null,null,null,null,null,null,{"$f":"IF(SUM([1]!PAPI20_21[[#This Row],[Recurso financeiro estimado no ano\n(R$) - Cobrança Estadual]:[Recurso financeiro estimado no ano (R$) - Outras]]) =0, \"\",SUM([1]!PAPI20_21[[#This Row],[Recurso financeiro estimado no ano\n(R$) - Cobrança Estadual]:[Recurso financeiro estimado no ano (R$) - Outras]]))","v":""}]
[null,null,null,null,null,null,null,null,null,null,{"$f":"IF(SUM([1]!PAPI20_21[[#This Row],[Recurso financeiro estimado no ano\n(R$) - Cobrança Estadual]:[Recurso financeiro estimado no ano (R$) - Outras]]) =0, \"\",SUM([1]!PAPI20_21[[#This Row],[Recurso financeiro estimado no ano\n(R$) - Cobrança Estadual]:[Recurso financeiro estimado no ano (R$) - Outras]]))","v":""}]
[null,null,null,null,null,null,null,null,null,null,{"$f":"IF(SUM([1]!PAPI20_21[[#This Row],[Recurso financeiro estimado no ano\n(R$) - Cobrança Estadual]:[Recurso financeiro estimado no ano (R$) - Outras]]) =0, \"\",SUM([1]!PAPI20_21[[#This Row],[Recurso financeiro estimado no ano\n(R$) - Cobrança Estadual]:[Recurso financeiro estimado no ano (R$) - Outras]]))","v":""}]
[null,null,null,null,null,null,null,null,null,null,{"$f":"IF(SUM([1]!PAPI20_21[[#This Row],[Recurso financeiro estimado no ano\n(R$) - Cobrança Estadual]:[Recurso financeiro estimado no ano (R$) - Outras]]) =0, \"\",SUM([1]!PAPI20_21[[#This Row],[Recurso financeiro estimado no ano\n(R$) - Cobrança Estadual]:[Recurso financeiro estimado no ano (R$) - Outras]]))","v":""}]
[null,null,null,null,null,null,null,null,null,null,{"$f":"IF(SUM([1]!PAPI20_21[[#This Row],[Recurso financeiro estimado no ano\n(R$) - Cobrança Estadual]:[Recurso financeiro estimado no ano (R$) - Outras]]) =0, \"\",SUM([1]!PAPI20_21[[#This Row],[Recurso financeiro estimado no ano\n(R$) - Cobrança Estadual]:[Recurso financeiro estimado no ano (R$) - Outras]]))","v":""}]
[null,null,null,null,null,null,null,null,null,null,{"$f":"IF(SUM([1]!PAPI20_21[[#This Row],[Recurso financeiro estimado no ano\n(R$) - Cobrança Estadual]:[Recurso financeiro estimado no ano (R$) - Outras]]) =0, \"\",SUM([1]!PAPI20_21[[#This Row],[Recurso financeiro estimado no ano\n(R$) - Cobrança Estadual]:[Recurso financeiro estimado no ano (R$) - Outras]]))","v":""}]
[null,null,null,null,null,null,null,null,null,null,{"$f":"IF(SUM([1]!PAPI20_21[[#This Row],[Recurso financeiro estimado no ano\n(R$) - Cobrança Estadual]:[Recurso financeiro estimado no ano (R$) - Outras]]) =0, \"\",SUM([1]!PAPI20_21[[#This Row],[Recurso financeiro estimado no ano\n(R$) - Cobrança Estadual]:[Recurso financeiro estimado no ano (R$) - Outras]]))","v":""}]
[null,null,null,null,null,null,null,null,null,null,{"$f":"IF(SUM([1]!PAPI20_21[[#This Row],[Recurso financeiro estimado no ano\n(R$) - Cobrança Estadual]:[Recurso financeiro estimado no ano (R$) - Outras]]) =0, \"\",SUM([1]!PAPI20_21[[#This Row],[Recurso financeiro estimado no ano\n(R$) - Cobrança Estadual]:[Recurso financeiro estimado no ano (R$) - Outras]]))","v":""}]
[null,null,null,null,null,null,null,null,null,null,{"$f":"IF(SUM([1]!PAPI20_21[[#This Row],[Recurso financeiro estimado no ano\n(R$) - Cobrança Estadual]:[Recurso financeiro estimado no ano (R$) - Outras]]) =0, \"\",SUM([1]!PAPI20_21[[#This Row],[Recurso financeiro estimado no ano\n(R$) - Cobrança Estadual]:[Recurso financeiro estimado no ano (R$) - Outras]]))","v":""}]
[null,null,null,null,null,null,null,null,null,null,{"$f":"IF(SUM([1]!PAPI20_21[[#This Row],[Recurso financeiro estimado no ano\n(R$) - Cobrança Estadual]:[Recurso financeiro estimado no ano (R$) - Outras]]) =0, \"\",SUM([1]!PAPI20_21[[#This Row],[Recurso financeiro estimado no ano\n(R$) - Cobrança Estadual]:[Recurso financeiro estimado no ano (R$) - Outras]]))","v":""}]
[null,null,null,null,null,null,null,null,null,null,{"$f":"IF(SUM([1]!PAPI20_21[[#This Row],[Recurso financeiro estimado no ano\n(R$) - Cobrança Estadual]:[Recurso financeiro estimado no ano (R$) - Outras]]) =0, \"\",SUM([1]!PAPI20_21[[#This Row],[Recurso financeiro estimado no ano\n(R$) - Cobrança Estadual]:[Recurso financeiro estimado no ano (R$) - Outras]]))","v":""}]
[null,null,null,null,null,null,null,null,null,null,{"$f":"IF(SUM([1]!PAPI20_21[[#This Row],[Recurso financeiro estimado no ano\n(R$) - Cobrança Estadual]:[Recurso financeiro estimado no ano (R$) - Outras]]) =0, \"\",SUM([1]!PAPI20_21[[#This Row],[Recurso financeiro estimado no ano\n(R$) - Cobrança Estadual]:[Recurso financeiro estimado no ano (R$) - Outras]]))","v":""}]
[null,null,null,null,null,null,null,null,null,null,{"$f":"IF(SUM([1]!PAPI20_21[[#This Row],[Recurso financeiro estimado no ano\n(R$) - Cobrança Estadual]:[Recurso financeiro estimado no ano (R$) - Outras]]) =0, \"\",SUM([1]!PAPI20_21[[#This Row],[Recurso financeiro estimado no ano\n(R$) - Cobrança Estadual]:[Recurso financeiro estimado no ano (R$) - Outras]]))","v":""}]
[null,null,null,null,null,null,null,null,null,null,{"$f":"IF(SUM([1]!PAPI20_21[[#This Row],[Recurso financeiro estimado no ano\n(R$) - Cobrança Estadual]:[Recurso financeiro estimado no ano (R$) - Outras]]) =0, \"\",SUM([1]!PAPI20_21[[#This Row],[Recurso financeiro estimado no ano\n(R$) - Cobrança Estadual]:[Recurso financeiro estimado no ano (R$) - Outras]]))","v":""}]
[null,null,null,null,null,null,null,null,null,null,{"$f":"IF(SUM([1]!PAPI20_21[[#This Row],[Recurso financeiro estimado no ano\n(R$) - Cobrança Estadual]:[Recurso financeiro estimado no ano (R$) - Outras]]) =0, \"\",SUM([1]!PAPI20_21[[#This Row],[Recurso financeiro estimado no ano\n(R$) - Cobrança Estadual]:[Recurso financeiro estimado no ano (R$) - Outras]]))","v":""}]
[null,null,null,null,null,null,null,null,null,null,{"$f":"IF(SUM([1]!PAPI20_21[[#This Row],[Recurso financeiro estimado no ano\n(R$) - Cobrança Estadual]:[Recurso financeiro estimado no ano (R$) - Outras]]) =0, \"\",SUM([1]!PAPI20_21[[#This Row],[Recurso financeiro estimado no ano\n(R$) - Cobrança Estadual]:[Recurso financeiro estimado no ano (R$) - Outras]]))","v":""}]
[null,null,null,null,null,null,null,null,null,null,{"$f":"IF(SUM([1]!PAPI20_21[[#This Row],[Recurso financeiro estimado no ano\n(R$) - Cobrança Estadual]:[Recurso financeiro estimado no ano (R$) - Outras]]) =0, \"\",SUM([1]!PAPI20_21[[#This Row],[Recurso financeiro estimado no ano\n(R$) - Cobrança Estadual]:[Recurso financeiro estimado no ano (R$) - Outras]]))","v":""}]
[null,null,null,null,null,null,null,null,null,null,{"$f":"IF(SUM([1]!PAPI20_21[[#This Row],[Recurso financeiro estimado no ano\n(R$) - Cobrança Estadual]:[Recurso financeiro estimado no ano (R$) - Outras]]) =0, \"\",SUM([1]!PAPI20_21[[#This Row],[Recurso financeiro estimado no ano\n(R$) - Cobrança Estadual]:[Recurso financeiro estimado no ano (R$) - Outras]]))","v":""}]
[null,null,null,null,null,null,null,null,null,null,{"$f":"IF(SUM([1]!PAPI20_21[[#This Row],[Recurso financeiro estimado no ano\n(R$) - Cobrança Estadual]:[Recurso financeiro estimado no ano (R$) - Outras]]) =0, \"\",SUM([1]!PAPI20_21[[#This Row],[Recurso financeiro estimado no ano\n(R$) - Cobrança Estadual]:[Recurso financeiro estimado no ano (R$) - Outras]]))","v":""}]
[null,null,null,null,null,null,null,null,null,null,{"$f":"IF(SUM([1]!PAPI20_21[[#This Row],[Recurso financeiro estimado no ano\n(R$) - Cobrança Estadual]:[Recurso financeiro estimado no ano (R$) - Outras]]) =0, \"\",SUM([1]!PAPI20_21[[#This Row],[Recurso financeiro estimado no ano\n(R$) - Cobrança Estadual]:[Recurso financeiro estimado no ano (R$) - Outras]]))","v":""}]
[null,null,null,null,null,null,null,null,null,null,{"$f":"IF(SUM([1]!PAPI20_21[[#This Row],[Recurso financeiro estimado no ano\n(R$) - Cobrança Estadual]:[Recurso financeiro estimado no ano (R$) - Outras]]) =0, \"\",SUM([1]!PAPI20_21[[#This Row],[Recurso financeiro estimado no ano\n(R$) - Cobrança Estadual]:[Recurso financeiro estimado no ano (R$) - Outras]]))","v":""}]
[null,null,null,null,null,null,null,null,null,null,{"$f":"IF(SUM([1]!PAPI20_21[[#This Row],[Recurso financeiro estimado no ano\n(R$) - Cobrança Estadual]:[Recurso financeiro estimado no ano (R$) - Outras]]) =0, \"\",SUM([1]!PAPI20_21[[#This Row],[Recurso financeiro estimado no ano\n(R$) - Cobrança Estadual]:[Recurso financeiro estimado no ano (R$) - Outras]]))","v":""}]
[null,null,null,null,null,null,null,null,null,null,{"$f":"IF(SUM([1]!PAPI20_21[[#This Row],[Recurso financeiro estimado no ano\n(R$) - Cobrança Estadual]:[Recurso financeiro estimado no ano (R$) - Outras]]) =0, \"\",SUM([1]!PAPI20_21[[#This Row],[Recurso financeiro estimado no ano\n(R$) - Cobrança Estadual]:[Recurso financeiro estimado no ano (R$) - Outras]]))","v":""}]
[null,null,null,null,null,null,null,null,null,null,{"$f":"IF(SUM([1]!PAPI20_21[[#This Row],[Recurso financeiro estimado no ano\n(R$) - Cobrança Estadual]:[Recurso financeiro estimado no ano (R$) - Outras]]) =0, \"\",SUM([1]!PAPI20_21[[#This Row],[Recurso financeiro estimado no ano\n(R$) - Cobrança Estadual]:[Recurso financeiro estimado no ano (R$) - Outras]]))","v":""}]
[null,null,null,null,null,null,null,null,null,null,{"$f":"IF(SUM([1]!PAPI20_21[[#This Row],[Recurso financeiro estimado no ano\n(R$) - Cobrança Estadual]:[Recurso financeiro estimado no ano (R$) - Outras]]) =0, \"\",SUM([1]!PAPI20_21[[#This Row],[Recurso financeiro estimado no ano\n(R$) - Cobrança Estadual]:[Recurso financeiro estimado no ano (R$) - Outras]]))","v":""}]
[null,null,null,null,null,null,null,null,null,null,{"$f":"IF(SUM([1]!PAPI20_21[[#This Row],[Recurso financeiro estimado no ano\n(R$) - Cobrança Estadual]:[Recurso financeiro estimado no ano (R$) - Outras]]) =0, \"\",SUM([1]!PAPI20_21[[#This Row],[Recurso financeiro estimado no ano\n(R$) - Cobrança Estadual]:[Recurso financeiro estimado no ano (R$) - Outras]]))","v":""}]
[null,null,null,null,null,null,null,null,null,null,{"$f":"IF(SUM([1]!PAPI20_21[[#This Row],[Recurso financeiro estimado no ano\n(R$) - Cobrança Estadual]:[Recurso financeiro estimado no ano (R$) - Outras]]) =0, \"\",SUM([1]!PAPI20_21[[#This Row],[Recurso financeiro estimado no ano\n(R$) - Cobrança Estadual]:[Recurso financeiro estimado no ano (R$) - Outras]]))","v":""}]
[null,null,null,null,null,null,null,null,null,null,{"$f":"IF(SUM([1]!PAPI20_21[[#This Row],[Recurso financeiro estimado no ano\n(R$) - Cobrança Estadual]:[Recurso financeiro estimado no ano (R$) - Outras]]) =0, \"\",SUM([1]!PAPI20_21[[#This Row],[Recurso financeiro estimado no ano\n(R$) - Cobrança Estadual]:[Recurso financeiro estimado no ano (R$) - Outras]]))","v":""}]
[null,null,null,null,null,null,null,null,null,null,{"$f":"IF(SUM([1]!PAPI20_21[[#This Row],[Recurso financeiro estimado no ano\n(R$) - Cobrança Estadual]:[Recurso financeiro estimado no ano (R$) - Outras]]) =0, \"\",SUM([1]!PAPI20_21[[#This Row],[Recurso financeiro estimado no ano\n(R$) - Cobrança Estadual]:[Recurso financeiro estimado no ano (R$) - Outras]]))","v":""}]
[null,null,null,null,null,null,null,null,null,null,{"$f":"IF(SUM([1]!PAPI20_21[[#This Row],[Recurso financeiro estimado no ano\n(R$) - Cobrança Estadual]:[Recurso financeiro estimado no ano (R$) - Outras]]) =0, \"\",SUM([1]!PAPI20_21[[#This Row],[Recurso financeiro estimado no ano\n(R$) - Cobrança Estadual]:[Recurso financeiro estimado no ano (R$) - Outras]]))","v":""}]
[null,null,null,null,null,null,null,null,null,null,{"$f":"IF(SUM([1]!PAPI20_21[[#This Row],[Recurso financeiro estimado no ano\n(R$) - Cobrança Estadual]:[Recurso financeiro estimado no ano (R$) - Outras]]) =0, \"\",SUM([1]!PAPI20_21[[#This Row],[Recurso financeiro estimado no ano\n(R$) - Cobrança Estadual]:[Recurso financeiro estimado no ano (R$) - Outras]]))","v":""}]
[null,null,null,null,null,null,null,null,null,null,{"$f":"IF(SUM([1]!PAPI20_21[[#This Row],[Recurso financeiro estimado no ano\n(R$) - Cobrança Estadual]:[Recurso financeiro estimado no ano (R$) - Outras]]) =0, \"\",SUM([1]!PAPI20_21[[#This Row],[Recurso financeiro estimado no ano\n(R$) - Cobrança Estadual]:[Recurso financeiro estimado no ano (R$) - Outras]]))","v":""}]
[null,null,null,null,null,null,null,null,null,null,{"$f":"IF(SUM([1]!PAPI20_21[[#This Row],[Recurso financeiro estimado no ano\n(R$) - Cobrança Estadual]:[Recurso financeiro estimado no ano (R$) - Outras]]) =0, \"\",SUM([1]!PAPI20_21[[#This Row],[Recurso financeiro estimado no ano\n(R$) - Cobrança Estadual]:[Recurso financeiro estimado no ano (R$) - Outras]]))","v":""}]
[null,null,null,null,null,null,null,null,null,null,{"$f":"IF(SUM([1]!PAPI20_21[[#This Row],[Recurso financeiro estimado no ano\n(R$) - Cobrança Estadual]:[Recurso financeiro estimado no ano (R$) - Outras]]) =0, \"\",SUM([1]!PAPI20_21[[#This Row],[Recurso financeiro estimado no ano\n(R$) - Cobrança Estadual]:[Recurso financeiro estimado no ano (R$) - Outras]]))","v":""}]
[null,null,null,null,null,null,null,null,null,null,{"$f":"IF(SUM([1]!PAPI20_21[[#This Row],[Recurso financeiro estimado no ano\n(R$) - Cobrança Estadual]:[Recurso financeiro estimado no ano (R$) - Outras]]) =0, \"\",SUM([1]!PAPI20_21[[#This Row],[Recurso financeiro estimado no ano\n(R$) - Cobrança Estadual]:[Recurso financeiro estimado no ano (R$) - Outras]]))","v":""}]
[null,null,null,null,null,null,null,null,null,null,{"$f":"IF(SUM([1]!PAPI20_21[[#This Row],[Recurso financeiro estimado no ano\n(R$) - Cobrança Estadual]:[Recurso financeiro estimado no ano (R$) - Outras]]) =0, \"\",SUM([1]!PAPI20_21[[#This Row],[Recurso financeiro estimado no ano\n(R$) - Cobrança Estadual]:[Recurso financeiro estimado no ano (R$) - Outras]]))","v":""}]
[null,null,null,null,null,null,null,null,null,null,{"$f":"IF(SUM([1]!PAPI20_21[[#This Row],[Recurso financeiro estimado no ano\n(R$) - Cobrança Estadual]:[Recurso financeiro estimado no ano (R$) - Outras]]) =0, \"\",SUM([1]!PAPI20_21[[#This Row],[Recurso financeiro estimado no ano\n(R$) - Cobrança Estadual]:[Recurso financeiro estimado no ano (R$) - Outras]]))","v":""}]
[null,null,null,null,null,null,null,null,null,null,{"$f":"IF(SUM([1]!PAPI20_21[[#This Row],[Recurso financeiro estimado no ano\n(R$) - Cobrança Estadual]:[Recurso financeiro estimado no ano (R$) - Outras]]) =0, \"\",SUM([1]!PAPI20_21[[#This Row],[Recurso financeiro estimado no ano\n(R$) - Cobrança Estadual]:[Recurso financeiro estimado no ano (R$) - Outras]]))","v":""}]
[null,null,null,null,null,null,null,null,null,null,{"$f":"IF(SUM([1]!PAPI20_21[[#This Row],[Recurso financeiro estimado no ano\n(R$) - Cobrança Estadual]:[Recurso financeiro estimado no ano (R$) - Outras]]) =0, \"\",SUM([1]!PAPI20_21[[#This Row],[Recurso financeiro estimado no ano\n(R$) - Cobrança Estadual]:[Recurso financeiro estimado no ano (R$) - Outras]]))","v":""}]
[null,null,null,null,null,null,null,null,null,null,{"$f":"IF(SUM([1]!PAPI20_21[[#This Row],[Recurso financeiro estimado no ano\n(R$) - Cobrança Estadual]:[Recurso financeiro estimado no ano (R$) - Outras]]) =0, \"\",SUM([1]!PAPI20_21[[#This Row],[Recurso financeiro estimado no ano\n(R$) - Cobrança Estadual]:[Recurso financeiro estimado no ano (R$) - Outras]]))","v":""}]
[null,null,null,null,null,null,null,null,null,null,{"$f":"IF(SUM([1]!PAPI20_21[[#This Row],[Recurso financeiro estimado no ano\n(R$) - Cobrança Estadual]:[Recurso financeiro estimado no ano (R$) - Outras]]) =0, \"\",SUM([1]!PAPI20_21[[#This Row],[Recurso financeiro estimado no ano\n(R$) - Cobrança Estadual]:[Recurso financeiro estimado no ano (R$) - Outras]]))","v":""}]
[null,null,null,null,null,null,null,null,null,null,{"$f":"IF(SUM([1]!PAPI20_21[[#This Row],[Recurso financeiro estimado no ano\n(R$) - Cobrança Estadual]:[Recurso financeiro estimado no ano (R$) - Outras]]) =0, \"\",SUM([1]!PAPI20_21[[#This Row],[Recurso financeiro estimado no ano\n(R$) - Cobrança Estadual]:[Recurso financeiro estimado no ano (R$) - Outras]]))","v":""}]
[null,null,null,null,null,null,null,null,null,null,{"$f":"IF(SUM([1]!PAPI20_21[[#This Row],[Recurso financeiro estimado no ano\n(R$) - Cobrança Estadual]:[Recurso financeiro estimado no ano (R$) - Outras]]) =0, \"\",SUM([1]!PAPI20_21[[#This Row],[Recurso financeiro estimado no ano\n(R$) - Cobrança Estadual]:[Recurso financeiro estimado no ano (R$) - Outras]]))","v":""}]
[null,null,null,null,null,null,null,null,null,null,{"$f":"IF(SUM([1]!PAPI20_21[[#This Row],[Recurso financeiro estimado no ano\n(R$) - Cobrança Estadual]:[Recurso financeiro estimado no ano (R$) - Outras]]) =0, \"\",SUM([1]!PAPI20_21[[#This Row],[Recurso financeiro estimado no ano\n(R$) - Cobrança Estadual]:[Recurso financeiro estimado no ano (R$) - Outras]]))","v":""}]
[null,null,null,null,null,null,null,null,null,null,{"$f":"IF(SUM([1]!PAPI20_21[[#This Row],[Recurso financeiro estimado no ano\n(R$) - Cobrança Estadual]:[Recurso financeiro estimado no ano (R$) - Outras]]) =0, \"\",SUM([1]!PAPI20_21[[#This Row],[Recurso financeiro estimado no ano\n(R$) - Cobrança Estadual]:[Recurso financeiro estimado no ano (R$) - Outras]]))","v":""}]
[null,null,null,null,null,null,null,null,null,null,{"$f":"IF(SUM([1]!PAPI20_21[[#This Row],[Recurso financeiro estimado no ano\n(R$) - Cobrança Estadual]:[Recurso financeiro estimado no ano (R$) - Outras]]) =0, \"\",SUM([1]!PAPI20_21[[#This Row],[Recurso financeiro estimado no ano\n(R$) - Cobrança Estadual]:[Recurso financeiro estimado no ano (R$) - Outras]]))","v":""}]
[null,null,null,null,null,null,null,null,null,null,{"$f":"IF(SUM([1]!PAPI20_21[[#This Row],[Recurso financeiro estimado no ano\n(R$) - Cobrança Estadual]:[Recurso financeiro estimado no ano (R$) - Outras]]) =0, \"\",SUM([1]!PAPI20_21[[#This Row],[Recurso financeiro estimado no ano\n(R$) - Cobrança Estadual]:[Recurso financeiro estimado no ano (R$) - Outras]]))","v":""}]
[null,null,null,null,null,null,null,null,null,null,{"$f":"IF(SUM([1]!PAPI20_21[[#This Row],[Recurso financeiro estimado no ano\n(R$) - Cobrança Estadual]:[Recurso financeiro estimado no ano (R$) - Outras]]) =0, \"\",SUM([1]!PAPI20_21[[#This Row],[Recurso financeiro estimado no ano\n(R$) - Cobrança Estadual]:[Recurso financeiro estimado no ano (R$) - Outras]]))","v":""}]
[null,null,null,null,null,null,null,null,null,null,{"$f":"IF(SUM([1]!PAPI20_21[[#This Row],[Recurso financeiro estimado no ano\n(R$) - Cobrança Estadual]:[Recurso financeiro estimado no ano (R$) - Outras]]) =0, \"\",SUM([1]!PAPI20_21[[#This Row],[Recurso financeiro estimado no ano\n(R$) - Cobrança Estadual]:[Recurso financeiro estimado no ano (R$) - Outras]]))","v":""}]
[null,null,null,null,null,null,null,null,null,null,{"$f":"IF(SUM([1]!PAPI20_21[[#This Row],[Recurso financeiro estimado no ano\n(R$) - Cobrança Estadual]:[Recurso financeiro estimado no ano (R$) - Outras]]) =0, \"\",SUM([1]!PAPI20_21[[#This Row],[Recurso financeiro estimado no ano\n(R$) - Cobrança Estadual]:[Recurso financeiro estimado no ano (R$) - Outras]]))","v":""}]
[null,null,null,null,null,null,null,null,null,null,{"$f":"IF(SUM([1]!PAPI20_21[[#This Row],[Recurso financeiro estimado no ano\n(R$) - Cobrança Estadual]:[Recurso financeiro estimado no ano (R$) - Outras]]) =0, \"\",SUM([1]!PAPI20_21[[#This Row],[Recurso financeiro estimado no ano\n(R$) - Cobrança Estadual]:[Recurso financeiro estimado no ano (R$) - Outras]]))","v":""}]
[null,null,null,null,null,null,null,null,null,null,{"$f":"IF(SUM([1]!PAPI20_21[[#This Row],[Recurso financeiro estimado no ano\n(R$) - Cobrança Estadual]:[Recurso financeiro estimado no ano (R$) - Outras]]) =0, \"\",SUM([1]!PAPI20_21[[#This Row],[Recurso financeiro estimado no ano\n(R$) - Cobrança Estadual]:[Recurso financeiro estimado no ano (R$) - Outras]]))","v":""}]
[null,null,null,null,null,null,null,null,null,null,{"$f":"IF(SUM([1]!PAPI20_21[[#This Row],[Recurso financeiro estimado no ano\n(R$) - Cobrança Estadual]:[Recurso financeiro estimado no ano (R$) - Outras]]) =0, \"\",SUM([1]!PAPI20_21[[#This Row],[Recurso financeiro estimado no ano\n(R$) - Cobrança Estadual]:[Recurso financeiro estimado no ano (R$) - Outras]]))","v":""}]
[null,null,null,null,null,null,null,null,null,null,{"$f":"IF(SUM([1]!PAPI20_21[[#This Row],[Recurso financeiro estimado no ano\n(R$) - Cobrança Estadual]:[Recurso financeiro estimado no ano (R$) - Outras]]) =0, \"\",SUM([1]!PAPI20_21[[#This Row],[Recurso financeiro estimado no ano\n(R$) - Cobrança Estadual]:[Recurso financeiro estimado no ano (R$) - Outras]]))","v":""}]
[null,null,null,null,null,null,null,null,null,null,{"$f":"IF(SUM([1]!PAPI20_21[[#This Row],[Recurso financeiro estimado no ano\n(R$) - Cobrança Estadual]:[Recurso financeiro estimado no ano (R$) - Outras]]) =0, \"\",SUM([1]!PAPI20_21[[#This Row],[Recurso financeiro estimado no ano\n(R$) - Cobrança Estadual]:[Recurso financeiro estimado no ano (R$) - Outras]]))","v":""}]
[null,null,null,null,null,null,null,null,null,null,{"$f":"IF(SUM([1]!PAPI20_21[[#This Row],[Recurso financeiro estimado no ano\n(R$) - Cobrança Estadual]:[Recurso financeiro estimado no ano (R$) - Outras]]) =0, \"\",SUM([1]!PAPI20_21[[#This Row],[Recurso financeiro estimado no ano\n(R$) - Cobrança Estadual]:[Recurso financeiro estimado no ano (R$) - Outras]]))","v":""}]

{"sheet":"Acomp. PAPI_22_23 (Delib. 246) ","index":9,"n_rows":140,"n_cols":11,"rows_kept":140,"cut":false,"hidden":true,"merged":[]}
["ID Ação","Ano","SubPDC","Prioridade do SubPDC","Ação","Meta","% Execução da meta","Segmento do executor","Área de abrangência","Nome da área de abrangência","Justificativa sobre execução física e financeira em 2024"]
["PCJ3.3.1.2/2022",2022,"1.2 - Planejamento","PDC 1 e 2","Fomento à Planos Municipais de Saneamento Rural","15 Planos Municipais de Saneamento Rural elaborados",0.15,"Município","Bacia","Bacias PCJ, observando os municípios e ACs prioritários para saneamento rural","Segundo normas do MPO-FEHIDRO, o prazo para emissão do contrato FEHIDRO para os empreendimentos deliberados em 2021 é até o dia 31/12/2021, sendo que a Deliberação COFEHIDRO nº240/21 prorrogou este prazo para 30/04/2022.Ainda, o prazo para licitação da empresa executora, pelos tomadores, é de 150 dias contados a partir da data de emissão do contrato.\nConsiderando que após a licitação, existe o tempo de trâmite dos documentos do processo licitatório ao Agente Técnico para, só então, o Agente Financeiro proceder com a liberação da primeira parcela, não houve quaisquer desembolsos para os empreendimentos"]
["PCJ3.3.1.2/2023",2023,"1.2 - Planejamento","PDC 1 e 2","Fomento à Planos Municipais de Saneamento Rural","15 Planos Municipais de Saneamento Rural elaborados",0,"Município","Bacia","Bacias PCJ, observando os municípios e ACs prioritários para saneamento rural"]
["PCJ6.3.1.5/2022",2022,"1.2 - Planejamento","PDC 1 e 2","Elaborar Plano de Comunicação quando de operações emergenciais das barragens","Contratação de 01 estudo para orientar a elaboração de Plano de Comunicação",0,"Sociedade civil","Bacia","Bacia Hidrográfica do rio Tietê"]
["PCJ6.3.1.5/2022",2022,"1.2 - Planejamento","PDC 1 e 2","Elaborar Plano de Comunicação quando de operações emergenciais das barragens","Contratação de 01 estudo para orientar a elaboração de Plano de Comunicação",0,"Sociedade civil","Bacia","Bacia Hidrográfica do rio Tietê"]
["PCJ6.3.1.7/2022",2022,"1.2 - Planejamento","PDC 1 e 2","Promover a compatibilidade entre os planos de cada UGRHI","Contratação de 01 estudo sobre a compatibilização dos planos de bacia hidrográfica dos CBHs da Bacia do Rio Tietê",0,"Sociedade civil","Bacia","Bacia Hidrográfica do rio Tietê"]
["PCJ6.3.1.7/2023",2023,"1.2 - Planejamento","PDC 1 e 2","Promover a compatibilidade entre os planos de cada UGRHI","Contratação de 01 estudo sobre a compatibilização dos planos de bacia hidrográfica dos CBHs da Bacia do Rio Tietê",0,"Sociedade civil","Bacia","Bacia Hidrográfica do rio Tietê"]
["PCJ1.2.1.5/2022",2022,"1.2 - Planejamento","PDC 1 e 2","Cadastro, caracterização e modelagem de cargas industriais","Ao menos 01 estudo realizado",0,"Sociedade civil","Bacia","Bacias PCJ"]
["PCJ1.2.1.5/2023",2023,"1.2 - Planejamento","PDC 1 e 2","Cadastro, caracterização e modelagem de cargas industriais","Ao menos 01 estudo realizado",0,"Sociedade civil","Bacia","Bacias PCJ"]
["PCJ1.2.1.7/2022",2022,"1.2 - Planejamento","PDC 1 e 2","Elaboração e revisão de planos municipais de saneamento básico","Ao menos 05 planos revisados/elaborados",0.15,"Município","Município","A definir"]
["PCJ1.2.1.7/2022",2022,"1.2 - Planejamento","PDC 1 e 2","Elaboração e revisão de planos municipais de saneamento básico","Ao menos 01 plano revisado/elaborado",0,"Sociedade civil","Município","A definir"]
["PCJ1.2.1.7/2023",2023,"1.2 - Planejamento","PDC 1 e 2","Elaboração e revisão de planos municipais de saneamento básico","Ao menos 05 planos revisados/elaborados",0,"Município","Município","A definir"]
["PCJ1.2.1.7/2023",2023,"1.2 - Planejamento","PDC 1 e 2","Elaboração e revisão de planos municipais de saneamento básico","Ao menos 01 plano revisado/elaborado",0,"Sociedade civil","Município","A definir"]
["PCJ2.3.2.1/2022",2022,"1.2 - Planejamento","PDC 1 e 2","Elaboração e revisão de Planos de Controle e Redução de Perdas","Ao menos 05 planos revisados/elaborados",0.15,"Município","Município","Municípios observando as prioridades no Plano de Bacias"]
["PCJ2.3.2.1/2023",2023,"1.2 - Planejamento","PDC 1 e 2","Elaboração e revisão de Planos de Controle e Redução de Perdas","Ao menos 05 planos revisados/elaborados",0,"Município","Município","Municípios observando as prioridades no Plano de Bacias"]
["PCJ6.2.2.1/2022",2022,"2.5 - Monitoramento e SI","PDC 1 e 2","Manutenção e aprimoramentos do SSD PCJ","Publicação de ao menos uma interface revisada",0,"Sociedade civil","Bacia","Bacias PCJ"]
["PCJ6.2.2.1/2023",2023,"2.5 - Monitoramento e SI","PDC 1 e 2","Manutenção e aprimoramentos do SSD PCJ","Publicação de ao menos uma interface revisada",0,"Sociedade civil","Bacia","Bacias PCJ"]
["PCJ6.2.3.1/2022",2022,"2.5 - Monitoramento e SI","PDC 1 e 2","Expansão, integração, operação e manutenção da rede de monitoramento quali-quantitativo dos recursos hídricos","Disponibilização dos dados de ao menos 36 postos ativos",0,"Sociedade civil","Bacia","Bacias PCJ"]
["PCJ6.2.3.1/2023",2023,"2.5 - Monitoramento e SI","PDC 1 e 2","Expansão, integração, operação e manutenção da rede de monitoramento quali-quantitativo dos recursos hídricos","Disponibilização dos dados de ao menos 36 postos ativos",0,"Sociedade civil","Bacia","Bacias PCJ"]
["PCJ6.2.3.3/2022",2022,"2.5 - Monitoramento e SI","PDC 1 e 2","Implantação, integração, operação e manutenção da rede de monitoramento quali-quantitativo das águas subterrâneas","Disponibilização dos dados de ao menos 02 postos ativos",0,"Sociedade civil","Bacia","Bacias PCJ"]
["PCJ6.2.3.3/2023",2023,"2.5 - Monitoramento e SI","PDC 1 e 2","Implantação, integração, operação e manutenção da rede de monitoramento quali-quantitativo das águas subterrâneas","Disponibilização dos dados de ao menos 02 postos ativos",0,"A definir","Bacia","Bacias PCJ"]
["PCJ2.3.3.2/2023",2023,"1.2 - Planejamento","PDC 1 e 2","Elaboração dos Planos Diretores de Drenagem Urbana e Manejo de Águas Pluviais","Elaboração de ao menos 01 Plano, considerando os trechos vulneráveis indicados no Plano de Bacias",0,"Município","Município","Municípios observando as prioridades no Plano de Bacias"]
["PCJ2.3.3.2/2023",2023,"1.2 - Planejamento","PDC 1 e 2","Elaboração dos Planos Diretores de Drenagem Urbana e Manejo de Águas Pluviais","Elaboração de ao menos 01 Plano, considerando os trechos vulneráveis indicados no Plano de Bacias",0,"Município","Município","Municípios observando as prioridades no Plano de Bacias"]
["PCJ2.2.4.1/2023",2023,"1.2 - Planejamento","PDC 1 e 2","Desenvolvimento de estudo de alternativas de aumento da disponibilidade hídrica nas sub-bacias dos rios Atibaia, Jundiaí e Capivari","Ao menos 01 estudo elaborado",0,"Sociedade civil","Sub-bacia","Sub-bacias Atibaia, Jundiaí e Capivari"]
["PCJ4.1.1.2/2023",2023,"2.2 - Outorga","PDC 1 e 2","Desenvolvimento de banco de dados de poços e suporte à decisão","Ao menos 01 banco de dados",0,"A definir","Bacia","Bacias PCJ"]
["PCJ2.1.1.1/2023",2023,"2.5 - Monitoramento e SI","PDC 1 e 2","Manutenção e aprimoramento de um modelo chuva-vazão para as Bacias PCJ","Disponibilidade de ao menos 01 modelo",0,"Sociedade civil","Bacia","Bacias PCJ"]
["PCJ2.1.1.1/2022",2022,"2.5 - Monitoramento e SI","PDC 1 e 2","Manutenção e aprimoramento de um modelo chuva-vazão para as Bacias PCJ","Disponibilidade de ao menos 01 modelo",0,"Sociedade civil","Bacia","Bacias PCJ"]
["PCJ2.1.1.1/2023",2023,"2.5 - Monitoramento e SI","PDC 1 e 2","Manutenção e aprimoramento de um modelo chuva-vazão para as Bacias PCJ","Disponibilidade de ao menos 01 modelo",0,"Sociedade civil","Bacia","Bacias PCJ"]
["PCJ1.1.1.2/2022",2022,"1.2 - Planejamento","PDC 1 e 2","Elaboração de estudos para ampliação e melhoria dos sistemas de transporte de esgotos","Elaboração de ao menos 01 estudo",0,"Município","Bacia","Municípios com prioridades para coleta, no Plano de Bacias"]
["PCJ1.1.1.2/2023",2023,"1.2 - Planejamento","PDC 1 e 2","Elaboração de estudos para ampliação e melhoria dos sistemas de transporte de esgotos","Elaboração de ao menos 01 estudo",0,"Município","Bacia","Municípios com prioridades para coleta, no Plano de Bacias"]
["PCJ1.1.1.2/2023",2023,"1.2 - Planejamento","PDC 1 e 2","Elaboração de estudos para ampliação e melhoria dos sistemas de transporte de esgotos","Elaboração de ao menos 01 estudo",0,"Município","Bacia","Municípios com prioridades para coleta, no Plano de Bacias"]
["PCJ1.1.2.2/2022",2022,"1.2 - Planejamento","PDC 1 e 2","Elaboração de estudos para a implantação de novas ETEs visando tratamento secundário","Elaboração de ao menos 01 estudo",0,"Município","Município","Municípios observando as prioridades para tratamento secundário, no Plano de Bacias"]
["PCJ1.1.2.2/2023",2023,"1.2 - Planejamento","PDC 1 e 2","Elaboração de estudos para a implantação de novas ETEs visando tratamento secundário","Elaboração de ao menos 01 estudo",0,"Município","Município","Municípios observando as prioridades para tratamento secundário, no Plano de Bacias"]
["PCJ1.2.1.1/2022",2022,"1.2 - Planejamento","PDC 1 e 2","Elaboração de estudos de melhorias da eficiência das ETEs na remoção de nutrientes","Elaboração de ao menos 01 estudo",0,"Município","Município","Municípios observando as prioridades para remoção de nitrogênio e fósforo, no Plano de Bacias"]
["PCJ1.2.1.1/2023",2023,"1.2 - Planejamento","PDC 1 e 2","Elaboração de estudos de melhorias da eficiência das ETEs na remoção de nutrientes","Elaboração de ao menos 01 estudo",0,"Município","Município","Municípios observando as prioridades para remoção de nitrogênio e fósforo, no Plano de Bacias"]
["PCJ4.3.2.1/2022",2022,"1.2 - Planejamento","PDC 1 e 2","Realizar os procedimentos estabelecidos para as áreas de restrição e controle já identificadas nas Bacias PCJ e avaliar a existência de novas áreas","Ao menos 01 estudo elaborado",0,"Sociedade civil","Bacia","Bacias PCJ"]
["PCJ4.3.2.1/2023",2023,"1.2 - Planejamento","PDC 1 e 2","Realizar os procedimentos estabelecidos para as áreas de restrição e controle já identificadas nas Bacias PCJ e avaliar a existência de novas áreas","Ao menos 01 estudo elaborado",0,"Sociedade civil","Bacia","Bacias PCJ"]
["PCJ6.1.1.2/2022",2022,"2.3 - Cobrança","PDC 1 e 2","Apoio operacional para a área de cobrança pelo uso dos recursos hídricos","Apoio operacional contínuo",0,"Sociedade civil","Bacia","Bacias PCJ"]
["PCJ6.1.1.2/2023",2023,"2.3 - Cobrança","PDC 1 e 2","Apoio operacional para a área de cobrança pelo uso dos recursos hídricos","Apoio operacional contínuo",0,"Sociedade civil","Bacia","Bacias PCJ"]
["PCJ6.1.1.5/2022",2022,"2.5 - Monitoramento e SI","PDC 1 e 2","Apoio operacional para acompanhamento de projetos da área de Sistema de Informações","Apoio operacional contínuo",0,"Sociedade civil","Bacia","Bacias PCJ"]
["PCJ6.1.1.5/2023",2023,"2.5 - Monitoramento e SI","PDC 1 e 2","Apoio operacional para acompanhamento de projetos da área de Sistema de Informações","Apoio operacional contínuo",0,"Sociedade civil","Bacia","Bacias PCJ"]
["PCJ6.2.5.3/2022",2022,"2.2 - Outorga","PDC 1 e 2","Apoio operacional para fiscalização de outorgas","Apoio operacional contínuo",0,"Sociedade civil","Bacia","Bacias PCJ"]
["PCJ6.2.5.3/2023",2023,"2.2 - Outorga","PDC 1 e 2","Apoio operacional para fiscalização de outorgas","Apoio operacional contínuo",0,"Sociedade civil","Bacia","Bacias PCJ"]
["PCJ6.1.1.4/2022",2022,"2.6 - Integração","PDC 1 e 2","Apoio Operacional para acompanhamento de empreendimentos de demanda espontânea","Apoio operacional contínuo",0,"Sociedade civil","Bacia","Bacias PCJ"]
["PCJ6.1.1.4/2023",2023,"2.6 - Integração","PDC 1 e 2","Apoio Operacional para acompanhamento de empreendimentos de demanda espontânea","Apoio operacional contínuo",0,"Sociedade civil","Bacia","Bacias PCJ"]
["PCJ6.1.2.2/2022",2022,"2.6 - Integração","PDC 1 e 2","Remuneração de agentes técnicos e financeiros para empreendimentos deliberados pelos Comitês PCJ","Desembolso de ao menos 60% do valor previsto",0,"Sociedade civil","Bacia","Bacias PCJ"]
["PCJ6.1.2.2/2023",2023,"2.6 - Integração","PDC 1 e 2","Remuneração de agentes técnicos e financeiros para empreendimentos deliberados pelos Comitês PCJ","Desembolso de ao menos 60% do valor previsto",0,"Sociedade civil","Bacia","Bacias PCJ"]
["PCJ6.1.2.1/2022",2022,"2.6 - Integração","PDC 1 e 2","Apoio operacional para a Secretaria Executiva dos Comitês PCJ","Apoio operacional contínuo",0,"Sociedade civil","Bacia","Bacias PCJ"]
["PCJ6.1.2.1/2023",2023,"2.6 - Integração","PDC 1 e 2","Apoio operacional para a Secretaria Executiva dos Comitês PCJ","Apoio operacional contínuo",0,"Sociedade civil","Bacia","Bacias PCJ"]
["PCJ6.1.1.3/2022",2022,"2.6 - Integração","PDC 1 e 2","Apoio operacional para acompanhamento de projetos de assessoria ambiental","Apoio operacional contínuo",0,"Sociedade civil","Bacia","Bacias PCJ"]
["PCJ6.1.1.3/2023",2023,"2.6 - Integração","PDC 1 e 2","Apoio operacional para acompanhamento de projetos de assessoria ambiental","Apoio operacional contínuo",0,"Sociedade civil","Bacia","Bacias PCJ"]
["PCJ6.1.1.1/2022",2022,"2.6 - Integração","PDC 1 e 2","Apoio operacional para a Área de Tecnologia da Informação - TI","Apoio operacional contínuo",0,"Sociedade civil","Bacia","Bacias PCJ"]
["PCJ6.1.1.1/2023",2023,"2.6 - Integração","PDC 1 e 2","Apoio operacional para a Área de Tecnologia da Informação - TI","Apoio operacional contínuo",0,"Sociedade civil","Bacia","Bacias PCJ"]
["PCJ6.1.2.3/2022",2022,"2.6 - Integração","PDC 1 e 2","Logística de Suporte às reuniões Plenárias e das CTs dos Comitês PCJ","Apoio operacional contínuo",0,"Sociedade civil","Bacia","Bacias PCJ"]
["PCJ6.1.2.3/2023",2023,"2.6 - Integração","PDC 1 e 2","Logística de Suporte às reuniões Plenárias e das CTs dos Comitês PCJ","Apoio operacional contínuo",0,"Sociedade civil","Bacia","Bacias PCJ"]
["PCJ6.1.2.5/2022",2022,"2.7 - CORHI","PDC 1 e 2","Manutenção de licenciamento de sistemas de TI","Apoio operacional contínuo",0,"Sociedade civil","Bacia","Bacias PCJ"]
["PCJ6.1.2.5/2023",2023,"2.7 - CORHI","PDC 1 e 2","Manutenção de licenciamento de sistemas de TI","Apoio operacional contínuo",0,"Sociedade civil","Bacia","Bacias PCJ"]
["PCJ6.1.2.4/2022",2022,"2.6 - Integração","PDC 1 e 2","Participação de membros dos Comitês PCJ em eventos internos das CTs e eventos externos","Desembolso de ao menos 70% do valor previsto",0,"Sociedade civil","Bacia","Bacias PCJ"]
["PCJ6.1.2.4/2023",2023,"2.6 - Integração","PDC 1 e 2","Participação de membros dos Comitês PCJ em eventos internos das CTs e eventos externos","Desembolso de ao menos 70% do valor previsto",0,"Sociedade civil","Bacia","Bacias PCJ"]
["PCJ6.1.1.7/2022",2022,"2.6 - Integração","PDC 1 e 2","Apoio operacional para acompanhamento de ações da porção mineira","Apoio operacional contínuo",0,"Sociedade civil","Bacia","Bacias PCJ"]
["PCJ6.1.1.7/2023",2023,"2.6 - Integração","PDC 1 e 2","Apoio operacional para acompanhamento de ações da porção mineira","Apoio operacional contínuo",0,"Sociedade civil","Bacia","Bacias PCJ"]
["PCJ6.2.6.1/2022",2022,"2.6 - Integração","PDC 1 e 2","Apoio operacional para gerenciamento da implementação e da revisão do Plano de Bacias","Contratação de ao menos 01 pessoa",0,"Sociedade civil","Bacia","Bacias PCJ"]
["PCJ6.2.6.1/2023",2023,"2.6 - Integração","PDC 1 e 2","Apoio operacional para gerenciamento da implementação e da revisão do Plano de Bacias","Contratação de ao menos 01 pessoa",0,"Sociedade civil","Bacia","Bacias PCJ"]
["PCJ1.1.1.1/2022",2022,"1.2 - Planejamento","PDC 1 e 2","Elaboração de estudos para ampliação e melhoria dos sistemas de coleta de esgotos","Elaboração de ao menos 01 estudo",0,"Município","Bacia","Municípios com prioridades para coleta, no Plano de Bacias"]
["PCJ1.1.1.1/2022",2022,"1.2 - Planejamento","PDC 1 e 2","Elaboração de estudos para ampliação e melhoria dos sistemas de coleta de esgotos","Elaboração de ao menos 01 estudo",0,"Município","Bacia","Municípios com prioridades para coleta, no Plano de Bacias"]
["PCJ1.1.1.1/2023",2023,"1.2 - Planejamento","PDC 1 e 2","Elaboração de estudos para ampliação e melhoria dos sistemas de coleta de esgotos","Elaboração de ao menos 01 estudo",0,"Município","Bacia","Municípios com prioridades para coleta, no Plano de Bacias"]
["PCJ6.2.4.1/2022",2022,"2.4 - Enquadramento","PDC 1 e 2","Encaminhamento do enquadramento da porção mineira das Bacias PCJ","Encaminhamento de uma proposta de enquadramento ao CERH-MG",0,"Sociedade civil","Sub-bacia","Porção Mineira das Bacias PCJ"]
["PCJ6.2.4.1/2023",2023,"2.4 - Enquadramento","PDC 1 e 2","Encaminhamento do enquadramento da porção mineira das Bacias PCJ","Encaminhamento de uma proposta de enquadramento ao CERH-MG",0,"Sociedade civil","Sub-bacia","Porção Mineira das Bacias PCJ"]
["PCJ2.3.1.1/2022",2022,"1.2 - Planejamento","PDC 1 e 2","Estudos de viabilidade para aumento de regularização de vazões em mananciais existentes e novos barramentos","Ao menos 01 plano revisado/elaborado",0,"Sociedade civil","Bacia","Bacias PCJ"]
["PCJ2.3.1.1/2023",2023,"1.2 - Planejamento","PDC 1 e 2","Estudos de viabilidade para aumento de regularização de vazões em mananciais existentes e novos barramentos","Ao menos 01 plano revisado/elaborado",0,"Sociedade civil","Bacia","Bacias PCJ"]
["PCJ6.2.1.1/2022",2022,"2.3 - Cobrança","PDC 1 e 2","Estudos para aprimoramento da cobrança pelo uso dos recursos hídricos","Ao menos 01 estudo elaborado",0,"Sociedade civil","Bacia","Bacias PCJ"]
["PCJ6.2.1.1/2023",2023,"2.3 - Cobrança","PDC 1 e 2","Estudos para aprimoramento da cobrança pelo uso dos recursos hídricos","Ao menos 01 estudo elaborado",0,"Sociedade civil","Bacia","Bacias PCJ"]
["PCJ1.1.2.4/2023",2023,"1.2 - Planejamento","PDC 1 e 2","Elaboração de estudos e relatórios visando o licenciamento das ETEs projetadas","Elaboração de ao menos 01 estudo",0,"A definir","Município","A definir"]
["PCJ2.2.2.1/2023",2023,"1.2 - Planejamento","PDC 1 e 2","Desenvolvimento de estudos de alternativas e intervenções para minimização dos riscos de inundação ribeirinha","Planos elaborados por sub-bacia e intervenções realizadas",0,"Sociedade civil","Bacia","Bacias PCJ"]
["PCJ2.2.1.1/2023",2023,"1.2 - Planejamento","PDC 1 e 2","Elaboração do plano diretor de reúso de água para as Bacias PCJ","01 Plano elaborado",0,"Sociedade civil","Bacia","Bacias PCJ"]
["PCJ6.1.2.6/2023",2023,"2.6 - Integração","PDC 1 e 2","Eventos especiais dos Comitês PCJ","Participação em ao menos 01 evento",0,"Sociedade civil","Bacia","Bacias PCJ"]
["PCJ5.4.1.1/2023",2023,"1.2 - Planejamento","PDC 1 e 2","Construção de propostas para a recuperação, conservação e proteção dos recursos hídricos em áreas rurais","Ao menos 01 proposta",0,"Sociedade civil","Bacia","Bacias PCJ"]
["PCJ1.2.2.2/2022",2022,"3.1 - Efluentes","Prioritário","Elaboração de projetos de implantação de tecnologias de desinfecção de efluentes domésticos","Elaboração de ao menos 01 projeto por ano",0,"Município","Município","A definir"]
["PCJ1.2.2.2/2022",2022,"3.1 - Efluentes","Prioritário","Elaboração de projetos de implantação de tecnologias de desinfecção de efluentes domésticos","Elaboração de ao menos 01 projeto por ano",0,"Município","Município","A definir"]
["PCJ1.2.2.2/2023",2023,"3.1 - Efluentes","Prioritário","Elaboração de projetos de implantação de tecnologias de desinfecção de efluentes domésticos","Elaboração de ao menos 01 projeto por ano",0,"Município","Município","A definir"]
["PCJ2.3.2.2/2022",2022,"5.1 - Perdas","Prioritário","Controle de perdas em sistemas de abastecimento de água","Alcance das metas intermediárias dos cenários de referência para planejamento, conforme descrito no Plano de Bacias",0.15,"Município","Município","Para 2020, municípios prioritários indicados na Deliberação dos Comitês PCJ nº 324/2019. A partir de 2021, municípios observando as prioridades do Plano de Bacias"]
["PCJ2.3.2.2/2022",2022,"5.1 - Perdas","Prioritário","Controle de perdas em sistemas de abastecimento de água","Alcance das metas intermediárias dos cenários de referência para planejamento, conforme descrito no Plano de Bacias",0,"Município","Município","Municípios observando as prioridades do Plano de Bacias"]
["PCJ2.3.2.2/2023",2023,"5.1 - Perdas","Prioritário","Controle de perdas em sistemas de abastecimento de água","Alcance das metas intermediárias dos cenários de referência para planejamento, conforme descrito no Plano de Bacias",0,"Município","Município","Para 2020, municípios prioritários indicados na Deliberação dos Comitês PCJ nº 324/2019. A partir de 2021, municípios observando as prioridades do Plano de Bacias"]
["PCJ2.3.2.2/2023",2023,"5.1 - Perdas","Prioritário","Controle de perdas em sistemas de abastecimento de água","Alcance das metas intermediárias dos cenários de referência para planejamento, conforme descrito no Plano de Bacias",0,"Município","Município","Para 2020, municípios prioritários indicados na Deliberação dos Comitês PCJ nº 324/2019. A partir de 2021, municípios observando as prioridades do Plano de Bacias"]
["PCJ2.3.2.2/2023",2023,"5.1 - Perdas","Prioritário","Controle de perdas em sistemas de abastecimento de água","Alcance das metas intermediárias dos cenários de referência para planejamento, conforme descrito no Plano de Bacias",0,"Município","Município","Municípios observando as prioridades do Plano de Bacias"]
["PCJ3.3.1.1/2023",2023,"3.1 - Efluentes","Prioritário","Substituição de sistemas rudimentares de tratamento de esgoto (fossa negra) por sistemas mais eficientes","Substituição de 30 sistemas",0,"Município","Município","Município"]
["PCJ1.1.1.4/2022",2022,"3.1 - Efluentes","Prioritário","Elaboração de projetos de ampliação e melhoria dos sistemas de transporte de esgotos","Elaboração de ao menos 01 projeto",0,"Município","Município","Municípios com prioridades para coleta, no Plano de Bacias"]
["PCJ1.1.1.4/2023",2023,"3.1 - Efluentes","Prioritário","Elaboração de projetos de ampliação e melhoria dos sistemas de transporte de esgotos","Elaboração de ao menos 01 projeto",0,"Município","Município","Municípios observando as prioridades para remoção de nitrogênio e fósforo, no Plano de Bacias"]
["PCJ1.1.1.4/2023",2023,"3.1 - Efluentes","Prioritário","Elaboração de projetos de ampliação e melhoria dos sistemas de transporte de esgotos","Elaboração de ao menos 01 projeto",0,"Município","Município","Municípios com prioridades para coleta, no Plano de Bacias"]
["PCJ1.1.2.3/2022",2022,"3.1 - Efluentes","Prioritário","Elaboração de projetos para a implantação de novas ETEs visando tratamento secundário","Elaboração de ao menos 01 projeto",0,"Município","Município","Municípios observando as prioridades para tratamento secundário, no Plano de Bacias"]
["PCJ1.1.2.3/2023",2023,"3.1 - Efluentes","Prioritário","Elaboração de projetos para a implantação de novas ETEs visando tratamento secundário","Elaboração de ao menos 01 projeto",0,"Município","Município","Municípios observando as prioridades para tratamento secundário, no Plano de Bacias"]
["PCJ1.1.2.3/2023",2023,"3.1 - Efluentes","Prioritário","Elaboração de projetos para a implantação de novas ETEs visando tratamento secundário","Elaboração de ao menos 01 projeto",0,"Município","Município","Municípios observando as prioridades para tratamento secundário, no Plano de Bacias"]
["PCJ1.1.2.3/2023",2023,"3.1 - Efluentes","Prioritário","Elaboração de projetos para a implantação de novas ETEs visando tratamento secundário","Elaboração de ao menos 01 projeto",0,"Município","Município","Municípios observando as prioridades para tratamento secundário, no Plano de Bacias"]
["PCJ1.2.1.2/2022",2022,"3.1 - Efluentes","Prioritário","Elaboração de projetos de melhorias da eficiência das ETEs na remoção de nutrientes","Elaboração de ao menos 01 projeto",0,"Município","Município","Municípios observando as prioridades para remoção de nitrogênio e fósforo, no Plano de Bacias"]
["PCJ1.2.1.2/2023",2023,"3.1 - Efluentes","Prioritário","Elaboração de projetos de melhorias da eficiência das ETEs na remoção de nutrientes","Elaboração de ao menos 01 projeto",0,"Município","Município","Municípios observando as prioridades para remoção de nitrogênio e fósforo, no Plano de Bacias"]
["PCJ1.2.1.2/2023",2023,"3.1 - Efluentes","Prioritário","Elaboração de projetos de melhorias da eficiência das ETEs na remoção de nutrientes","Elaboração de ao menos 01 projeto",0,"Município","Município","Municípios observando as prioridades para remoção de nitrogênio e fósforo, no Plano de Bacias"]
["PCJ1.1.1.3/2022",2022,"3.1 - Efluentes","Prioritário","Elaboração de projetos de ampliação e melhoria dos sistemas de coleta de esgotos","Elaboração de ao menos 01 projeto",0,"Município","Município","Municípios com prioridades para coleta, no Plano de Bacias"]
["PCJ1.1.1.3/2023",2023,"3.1 - Efluentes","Prioritário","Elaboração de projetos de ampliação e melhoria dos sistemas de coleta de esgotos","Elaboração de ao menos 01 projeto",0,"Município","Município","Municípios com prioridades para coleta, no Plano de Bacias"]
["PCJ1.2.1.8/2022",2022,"3.1 - Efluentes","Prioritário","Implantação de Unidades de Tratamento de Lodo nas ETAs","Ao menos 01 projeto realizado",0,"Município","Município","A definir"]
["PCJ1.2.1.8/2023",2023,"3.1 - Efluentes","Prioritário","Implantação de Unidades de Tratamento de Lodo nas ETAs","Ao menos 01 projeto realizado",0,"Município","Município","A definir"]
["PCJ1.1.1.5/2022",2022,"3.1 - Efluentes","Prioritário","Ampliações e melhoria dos sistemas de coleta de esgotos","Ampliação dos sistemas de coleta de esgotos de pelo menos 20% dos municípios prioritários",0,"Município","Município","Municípios observando as prioridades no Plano de Bacias"]
["PCJ1.1.1.5/2023",2023,"3.1 - Efluentes","Prioritário","Ampliações e melhoria dos sistemas de coleta de esgotos","Ampliação dos sistemas de coleta de esgotos de pelo menos 20% dos municípios prioritários",0,"Município","Município","Municípios observando as prioridades no Plano de Bacias"]
["PCJ1.1.2.5/2022",2022,"3.1 - Efluentes","Prioritário","Implantação das ETEs projetadas e melhorias das ETEs existentes","Ao menos 01 ETE implantada",0,"Município","Bacia","Bacias PCJ, observando as prioridades para tratamento secundário."]
["PCJ1.1.2.5/2023",2023,"3.1 - Efluentes","Prioritário","Implantação das ETEs projetadas e melhorias das ETEs existentes","Ao menos 01 ETE implantada",0,"Município","Bacia","Bacias PCJ, observando as prioridades para tratamento secundário."]
["PCJ2.3.2.3/2022",2022,"5.1 - Perdas","Prioritário","Manutenção do projeto de benchmarking para o controle de perdas de água em sistemas de distribuição","Ao menos 01 manutenção realizada",0,"Sociedade Civil","Bacia","Bacias PCJ"]
["PCJ2.3.2.3/2023",2023,"3.1 - Efluentes","Prioritário","Melhoria e recuperação da qualidade das águas","Alcance das metas intermediárias dos cenários de referência para planejamento, conforme descrito no Plano de Bacias",0,"Município","Município","Municípios prioritários indicados na Deliberação dos Comitês PCJ nº 324/2019"]
["PCJ2.3.2.3/2023",2023,"3.1 - Efluentes","Prioritário","Manutenção do projeto de benchmarking para o controle de perdas de água em sistemas de distribuição","Ao menos 01 manutenção realizada",0,"Sociedade Civil","Bacia","Bacias PCJ"]
["PCJ3.1.3.1/2022",2022,"4.2 - Conservação","Não prioritário","Implementação de projetos de PSA","Contratação de ao menos 02 projetos aprovados nos Editais anualmente",0,"Município","Bacia","Áreas de Contribuição das Bacias PCJ prioritárias conforme mapa síntese, Mapa Conservação, recuperação de nascentes, matas ciliares e áreas de recarga do Plano de Bacias"]
["PCJ3.1.3.1/2022",2022,"4.2 - Conservação","Não prioritário","Implementação de projetos de PSA","Contratação de ao menos 01 projeto aprovado no Edital anualmente",0,"Município","Bacia","Áreas de Contribuição das Bacias PCJ prioritárias conforme mapa síntese, Mapa Conservação, recuperação de nascentes, matas ciliares e áreas de recarga do Plano de Bacias"]
["PCJ3.1.3.1/2023",2023,"4.2 - Conservação","Não prioritário","Implementação de projetos de PSA","Contratação de ao menos 02 projetos aprovados nos Editais anualmente",0,"Município","Bacia","Áreas de Contribuição das Bacias PCJ prioritárias conforme mapa síntese, Mapa Conservação, recuperação de nascentes, matas ciliares e áreas de recarga do Plano de Bacias"]
["PCJ3.1.3.1/2023",2023,"4.2 - Conservação","Não prioritário","Implementação de projetos de PSA","Contratação de ao menos 01 projeto aprovado no Edital anualmente",0,"Município","Bacia","Áreas de Contribuição das Bacias PCJ prioritárias conforme mapa síntese, Mapa Conservação, recuperação de nascentes, matas ciliares e áreas de recarga do Plano de Bacias"]
["PCJ3.1.2.1/2022",2022,"4.2 - Conservação","Não prioritário","Promoção da conservação e recuperação de nascentes, matas ciliares e áreas de recarga","Recuperação de 40 hectares de áreas prioritárias por ano",0,"A definir","Bacia","Áreas de Contribuição das Bacias PCJ prioritárias conforme mapa síntese, Mapa Conservação, recuperação de nascentes, matas ciliares e áreas de recarga do Plano de Bacias"]
["PCJ3.1.2.1/2023",2023,"4.2 - Conservação","Não prioritário","Promoção da conservação e recuperação de nascentes, matas ciliares e áreas de recarga","Recuperação de 40 hectares de áreas prioritárias por ano",0,"Município","Bacia","Áreas de Contribuição das Bacias PCJ prioritárias conforme mapa síntese, Mapa Conservação, recuperação de nascentes, matas ciliares e áreas de recarga do Plano de Bacias"]
["PCJ3.1.2.1/2023",2023,"4.2 - Conservação","Não prioritário","Promoção da conservação e recuperação de nascentes, matas ciliares e áreas de recarga","Recuperação de 40 hectares de áreas prioritárias por ano",0,"A definir","Bacia","Áreas de Contribuição das Bacias PCJ prioritárias conforme mapa síntese, Mapa Conservação, recuperação de nascentes, matas ciliares e áreas de recarga do Plano de Bacias"]
["PCJ3.1.2.1/2023",2023,"4.2 - Conservação","Não prioritário","Promoção da conservação e recuperação de nascentes, matas ciliares e áreas de recarga","Recuperação de 10 hectares de áreas prioritárias por ano",0,"A definir","Bacia","Áreas de Contribuição das Bacias PCJ prioritárias conforme mapa síntese, Mapa Conservação, recuperação de nascentes, matas ciliares e áreas de recarga do Plano de Bacias"]
["PCJ3.1.2.2/2022",2022,"4.2 - Conservação","Não prioritário","Promoção do isolamento de fatores de degradação em matas ciliares e áreas de recarga","Cercamento de 10.600 metros por ano",0,"Município","Bacia","Bacias PCJ"]
["PCJ3.1.2.2/2023",2023,"4.2 - Conservação","Não prioritário","Promoção do isolamento de fatores de degradação em matas ciliares e áreas de recarga","Cercamento de 10.600 metros por ano",0,"Município","Bacia","Bacias PCJ"]
["PCJ5.3.1.1/202",2022,"8.1 - Capacitação","Não prioritário","Processos formativos de representantes dos poderes legislativo, executivo, judiciário e líderes comunitários sobre a realidade socioambiental das Bacias PCJ e as prioridades do Plano de Bacias","Formação de pelo menos um representante de cada grupo (poderes legislativo, executivo, judiciário e líderes comunitários)",0,"Sociedade civil","Bacia","Bacias PCJ"]
["PCJ5.3.1.1/2023",2023,"8.1 - Capacitação","Não prioritário","Processos formativos de representantes dos poderes legislativo, executivo, judiciário e líderes comunitários sobre a realidade socioambiental das Bacias PCJ e as prioridades do Plano de Bacias","Formação de pelo menos um representante de cada grupo (poderes legislativo, executivo, judiciário e líderes comunitários)",0,"A definir","Bacia","Bacias PCJ"]
["PCJ6.3.1.2/2022",2022,"8.1 - Capacitação","Não prioritário","Elaborar ações de comunicação social para a Bacia do Tietê","Elaboração de 01 plano e implantação de programa de comunicação social na Bacia do Tietê",0.15,"Sociedade civil","Bacia","Bacia do rio Tietê"]
["PCJ3.1.1.1/2022",2022,"4.3 - Mananciais","Não prioritário","Desenvolvimento e monitoramento da implementação dos PIPs","Contratação da elaboração de PIPs para 1.000 hectares por ano",0,"A definir","Bacia","Bacias PCJ"]
["PCJ3.1.1.1/2023",2023,"4.3 - Mananciais","Não prioritário","Desenvolvimento e monitoramento da implementação dos PIPs","Contratação da elaboração de PIPs para 1.000 hectares por ano",0,"A definir","Bacia","Bacias PCJ"]
["PCJ5.3.1.2/2022",2022,"8.1 - Capacitação","Não prioritário","Elaboração de um Plano de Capacitação Técnica e realização de processos formativos nas áreas de atuação das Câmaras Técnicas","01 Plano elaborado e ao menos 12 membros capacitados em nível de pós-graduação",0,"Sociedade civil","Bacia","Bacias PCJ"]
["PCJ5.3.1.2/2023",2023,"8.1 - Capacitação","Não prioritário","Elaboração de um Plano de Capacitação Técnica e realização de processos formativos nas áreas de atuação das Câmaras Técnicas","01 Plano elaborado e ao menos 12 membros capacitados em nível de pós-graduação",0,"Sociedade civil","Bacia","Bacias PCJ"]
["PCJ1.4.1.2/2022",2022,"8.1 - Capacitação","Não prioritário","Ampliação e divulgação do programa de capacitação (Escola da Água e Saneamento), fomento e incentivo à capacitação de operadores","Capacitação de ao menos 05 turmas por ano",0,"Sociedade civil","Bacia","Bacias PCJ"]
["PCJ1.4.1.2/2023",2023,"8.1 - Capacitação","Não prioritário","Ampliação e divulgação do programa de capacitação (Escola da Água e Saneamento), fomento e incentivo à capacitação de operadores","Capacitação de ao menos 05 turmas por ano",0,"Sociedade civil","Bacia","Bacias PCJ"]
["PCJ5.2.1.2/2022",2022,"8.2 - Educação","Não prioritário","Realização de processos formativos e campanhas educativas sobre a realidade das Bacias PCJ","Ao menos 01 processo formativo e uma campanha educativa realizada",0,"Sociedade civil","Bacia","Bacias PCJ"]
["PCJ5.2.1.2/2023",2023,"8.2 - Educação","Não prioritário","Realização de processos formativos e campanhas educativas sobre a realidade das Bacias PCJ","Ao menos 01 processo formativo e uma campanha educativa realizada",0,"Sociedade civil","Bacia","Bacias PCJ"]
["PCJ5.1.1.1/2022",2022,"8.3 - Comunicação","Não prioritário","Elaboração e execução de um Plano de Comunicação para o fortalecimento da comunicação entre a sociedade civil e os Comitês PCJ","01 Plano elaborado e ações implementadas",0,"Sociedade civil","Bacia","Bacias PCJ"]
["PCJ5.1.1.1/2023",2023,"8.3 - Comunicação","Não prioritário","Elaboração e execução de um Plano de Comunicação para o fortalecimento da comunicação entre a sociedade civil e os Comitês PCJ","01 Plano elaborado e ações implementadas",0,"Sociedade civil","Bacia","Bacias PCJ"]
["PCJ6.1.1.6/2022",2022,"8.3 - Comunicação","Não prioritário","Apoio operacional para a área de comunicação social","Apoio operacional contínuo",0,"Sociedade civil","Bacia","Bacias PCJ"]
["PCJ6.1.1.6/2023",2023,"8.3 - Comunicação","Não prioritário","Apoio operacional para a área de comunicação social","Apoio operacional contínuo",0,"Sociedade civil","Bacia","Bacias PCJ"]
["PCJ3.1.2.5/2022",2022,"4.1 - Erosão","Não prioritário","Estabilização de voçorocas nas propriedades que receberão projetos de recomposição florestal","Estabilização de 10 voçorocas/ano nas propriedades que recebem projetos de recomposição florestal",0,"A definir","Bacia","Áreas de Contribuição das Bacias PCJ prioritárias conforme mapa síntese, Mapa Conservação, recuperação de nascentes, matas ciliares e áreas de recarga do Plano de Bacias"]
["PCJ3.1.2.5/2023",2023,"4.1 - Erosão","Não prioritário","Estabilização de voçorocas nas propriedades que receberão projetos de recomposição florestal","Estabilização de 10 voçorocas/ano nas propriedades que recebem projetos de recomposição florestal",0,"A definir","Bacia","Áreas de Contribuição das Bacias PCJ prioritárias conforme mapa síntese, Mapa Conservação, recuperação de nascentes, matas ciliares e áreas de recarga do Plano de Bacias"]
["PCJ3.1.2.6/2022",2022,"4.1 - Erosão","Não prioritário","Aplicação de técnicas de conservação do solo em propriedades que receberão os projetos de recomposição florestal","Aplicação de técnicas de conservação do solo em aproximadamente 360 ha/ano",0,"A definir","Bacia","Áreas de Contribuição das Bacias PCJ prioritárias conforme mapa síntese, Mapa Conservação, recuperação de nascentes, matas ciliares e áreas de recarga do Plano de Bacias"]
["PCJ3.1.2.6/2023",2023,"4.1 - Erosão","Não prioritário","Aplicação de técnicas de conservação do solo em propriedades que receberão os projetos de recomposição florestal","Aplicação de técnicas de conservação do solo em aproximadamente 360 ha/ano",0,"A definir","Bacia","Áreas de Contribuição das Bacias PCJ prioritárias conforme mapa síntese, Mapa Conservação, recuperação de nascentes, matas ciliares e áreas de recarga do Plano de Bacias"]
["PCJ3.2.1.1/2022",2022,"4.1 - Erosão","Não prioritário","Execução de intervenções de conservação de solo","Conservação de solo em 300 hectares por ano",0,"Município","Bacia","Áreas de Contribuição das Bacias PCJ prioritárias conforme mapa síntese, Mapa Conservação, recuperação de nascentes, matas ciliares e áreas de recarga do Plano de Bacias."]
["PCJ3.2.1.1/2023",2023,"4.1 - Erosão","Não prioritário","Execução de intervenções de conservação de solo","Conservação de solo em 300 hectares por ano",0,"Município","Bacia","Áreas de Contribuição das Bacias PCJ prioritárias conforme mapa síntese, Mapa Conservação, recuperação de nascentes, matas ciliares e áreas de recarga do Plano de Bacias"]
["PCJ3.1.2.4/2022",2022,"8.3 - Comunicação","Não prioritário","Fomento à elaboração de planos integrados de recomposição florestal e proteção dos biomas Mata Atlântica e Cerrado","Capacitar os municípios para o desenvolvimento dos Planos",0,"Sociedade Civil","Bacia","Bacias PCJ"]
["PCJ3.1.2.4/2023",2023,"8.3 - Comunicação","Não prioritário","Fomento à elaboração de planos integrados de recomposição florestal e proteção dos biomas Mata Atlântica e Cerrado","Capacitar os municípios para o desenvolvimento dos Planos",0,"Sociedade Civil","Bacia","Bacias PCJ"]

{"sheet":"Operacional","index":10,"n_rows":76,"n_cols":95,"rows_kept":76,"cut":false,"hidden":false,"merged":[]}
[null,"SubPDC - Delib.CRH N° 190 /2016","SubPDC - Delib.CRH N° 246/2021 ",null,"Area","Executor","Fonte",null,"Tipo de Ação",null,"Prioridade",null,"Fonte"]
[null,"1.1 - SI","Não se aplica",null,"APRM","Estado","CFURH",null,"Obra",null,"Não prioritário",null,"FEHIDRO - Cobrança estadual"]
[null,"1.2 - Planejamento","1.1 - Legislação",null,"Aquífero","Município","Cobrança Estadual",null,"Serviços",null,"PDC 1 e 2",null,"FEHIDRO - CFURH"]
[null,"1.3 - Enquadramento","1.2 - Planejamento",null,"Área rural","Sociedade Civil","Outras",null,"Projeto Básico/Executivo",null,"Prioritário",null,"Cobrança Federal"]
[null,"1.4 - Monitoramento","2.1 - Plano",null,"Área urbana","Município e Sociedade Civil","Cobrança Federal",null,"Estudo/Diagnóstico",null,null,null,"Tesouro do Estado"]
[null,"1.5 - Disponibilidade","2.2 - Outorga",null,"Bacia","Estado e Município",null,null,"Capacitação",null,null,null,"Fundo especial de despesa\n"]
[null,"1.6 - Legislação","2.3 - Cobrança",null,"Corpo hídrico","Estado e Sociedade Civil",null,null,null,null,null,null,"Recursos da administração indireta"]
[null,"1.7 - Poluição","2.4 - Enquadramento",null,"Município","Estado, Município e Sociedade Civil",null,null,null,null,null,null,"Recursos vinculados federais"]
[null,"2.1 - Planos","2.5 - Redes de monitoramento e SI",null,"Região Hidrográfica","Iniciativa privada",null,null,null,null,null,null,"Operações de crédito"]
[null,"2.2 - Outorga","2.6 - Integração",null,"Sub-bacia",null,null,null,null,null,null,null,"Recursos privados da sociedade civil"]
[null,"2.3 - Cobrança","2.7 - CORHI",null,"UGRHi",null,null,null,null,null,null,null,"Recursos de instrumentos de fomento"]
[null,"2.4 - Efetivação","3.1 - Efluentes",null,"Outra",null,null,null,null,null,null,null,"Outras fontes"]
[null,"2.5 - Integração","3.2 - Poluição"]
[null,"2.6 - CORHI","3.3 - Resíduos"]
[null,"3.1 - Efluentes","3.4 - Intervenções"]
[null,"3.2 - Resíduos","4.1 - Controle erosão",null,null,null,"PRIORIDADE"]
[null,"3.3 - Drenagem","4.2 - Soluções baseadas Natureza",null,null,null,"PDC 1 e 2"]
[null,"3.4 - Erosão","4.3 - Mananciais",null,null,null,"Prioritário"]
[null,"3.5 - Intervenções","5.1 - Perdas",null,null,null,"Não prioritário"]
[null,"4.1 - Mananciais","5.2 - Racionalização"]
[null,"4.2 - Vegetação","5.3 - Reuso",null,"Area"]
[null,"5.1 - Perdas","6.1 - Captação",null,"APRM"]
[null,"5.2 - Racionalização","6.2 - Regularização",null,"Aquífero"]
[null,"5.3 - Reuso","7.1 - Drenagem",null,"Área rural (via de circulação; rodovia; distrito; etc.)"]
[null,"6.1 - Usos","7.2 - Escassez",null,"Área urbana (bairro; via de circulação; distrito; praça; parque; etc.)"]
[null,"6.2 - Segurança","8.1 - Capacitação",null,"Bacia"]
[null,"6.3 - Aproveitamento","8.2 - Educação",null,"Corpo hídrico"]
[null,"7.1 - Criticidades","8.3 - Comunicação",null,"Município"]
[null,"7.2 - Inundações",null,null,"Região Hidrográfica"]
[null,"7.3 - Estiagens",null,null,"Sub-bacia"]
[null,"8.1 - Capacitação",null,null,"UGRHi"]
[null,"8.2 - Educação"]
[null,"8.3 - Comunicação"]
[]
[]
[null,"Delib. CRH N° 246/2021 ",null,null,null,null,null,null,null,null,null,null,null,null,null,null,null,null,null,null,null,null,null,null,null,null,null,null,null,null,null,null,null,null,null,null,null,null,null,null,null,null,null,null,null,null,null,null,null,null,null,null,null,null,null,null,null,null,null,null,null,null,null,"Delib. CRH N° 190/2016, revogada a partir de 31/12/21"]
["Não se aplica","1.1 - Legislação","1.2 - Planejamento","2.1 - Plano","2.2 - Outorga","2.3 - Cobrança","2.4 - Enquadramento","2.5 - Redes de monitoramento e SI","2.6 - Integração","2.7 - CORHI","3.1 - Efluentes","3.2 - Poluição","3.3 - Resíduos","3.4 - Intervenções","4.1 - Controle erosão","4.2 - Soluções baseadas Natureza","4.3 - Mananciais","5.1 - Perdas","5.2 - Racionalização","5.3 - Reuso","6.1 - Captação","6.2 - Regularização","7.1 - Drenagem","7.2 - Escassez","8.1 - Capacitação","8.2 - Educação","8.3 - Comunicação",null,null,null,null,null,null,null,null,null,null,null,null,null,null,null,null,null,null,null,null,null,null,null,null,null,null,null,null,null,null,null,null,2020,2021,null,null,"1.1 - SI","1.2 - Planejamento","1.3 - Enquadramento","1.4 - Monitoramento","1.5 - Disponibilidade","1.6 - Legislação","1.7 - Poluição","2.1 - Planos","2.2 - Outorga","2.3 - Cobrança","2.4 - Efetivação","2.5 - Integração","2.6 - CORHI","3.1 - Efluentes","3.2 - Resíduos","3.3 - Drenagem","3.4 - Erosão","3.5 - Intervenções","4.1 - Mananciais","4.2 - Vegetação","5.1 - Perdas","5.2 - Racionalização","5.3 - Reuso","6.1 - Usos","6.2 - Segurança","6.3 - Aproveitamento","7.1 - Criticidades","7.2 - Inundações","7.3 - Estiagens","8.1 - Capacitação","8.2 - Educação","8.3 - Comunicação"]
["Não se aplica","PDC 1 e 2","PDC 1 e 2","PDC 1 e 2","PDC 1 e 2","PDC 1 e 2","PDC 1 e 2","PDC 1 e 2","PDC 1 e 2","PDC 1 e 2","Prioritário","Prioritário","Prioritário","Prioritário","Prioritário","Prioritário","Prioritário","Prioritário","Prioritário","Prioritário","Prioritário","Prioritário","Prioritário","Prioritário","Prioritário","Prioritário","Prioritário",null,null,null,null,null,null,null,null,null,null,null,null,null,null,null,null,null,null,null,null,null,null,null,null,null,null,null,null,null,null,null,null,"1.1","1.1",null,null,"PDC 1 e 2","PDC 1 e 2","PDC 1 e 2","PDC 1 e 2","PDC 1 e 2","PDC 1 e 2","PDC 1 e 2","PDC 1 e 2","PDC 1 e 2","PDC 1 e 2","PDC 1 e 2","PDC 1 e 2","PDC 1 e 2","Prioritário","Prioritário","Prioritário","Prioritário","Prioritário","Prioritário","Prioritário","Prioritário","Prioritário","Prioritário","Prioritário","Prioritário","Prioritário","Prioritário","Prioritário","Prioritário","Prioritário","Prioritário","Prioritário"]
[null,null,null,null,null,null,null,null,null,null,"Não prioritário","Não prioritário","Não prioritário","Não prioritário","Não prioritário","Não prioritário","Não prioritário","Não prioritário","Não prioritário","Não prioritário","Não prioritário","Não prioritário","Não prioritário","Não prioritário","Não prioritário","Não prioritário","Não prioritário",null,null,null,null,null,null,null,null,null,null,null,null,null,null,null,null,null,null,null,null,null,null,null,null,null,null,null,null,null,null,null,null,"1.2","1.2",null,null,null,null,null,null,null,null,null,null,null,null,null,null,null,"Não prioritário","Não prioritário","Não prioritário","Não prioritário","Não prioritário","Não prioritário","Não prioritário","Não prioritário","Não prioritário","Não prioritário","Não prioritário","Não prioritário","Não prioritário","Não prioritário","Não prioritário","Não prioritário","Não prioritário","Não prioritário","Não prioritário"]
[null,null,null,null,null,null,null,null,null,null,null,null,null,null,null,null,null,null,null,null,null,null,null,null,null,null,null,null,null,null,null,null,null,null,null,null,null,null,null,null,null,null,null,null,null,null,null,null,null,null,null,null,null,null,null,null,null,null,null,"1.3","1.3"]
[null,null,null,null,null,null,null,null,null,null,null,null,null,null,null,null,null,null,null,null,null,null,null,null,null,null,null,null,null,null,null,null,null,null,null,null,null,null,null,null,null,null,null,null,null,null,null,null,null,null,null,null,null,null,null,null,null,null,null,"1.4","1.4"]
[null,null,null,null,null,null,null,null,null,null,null,null,null,null,null,null,null,null,null,null,null,null,null,null,null,null,null,null,null,null,null,null,null,null,null,null,null,null,null,null,null,null,null,null,null,null,null,null,null,null,null,null,null,null,null,null,null,null,null,"1.5","1.5"]
[null,null,null,null,null,null,null,null,null,null,null,null,null,null,null,null,null,null,null,null,null,null,null,null,null,null,null,null,null,null,null,null,null,null,null,null,null,null,null,null,null,null,null,null,null,null,null,null,null,null,null,null,null,null,null,null,null,null,null,"1.6","1.6"]
[null,null,null,null,null,null,null,null,null,null,null,null,null,null,null,null,null,null,null,null,null,null,null,null,null,null,null,null,null,null,null,null,null,null,null,null,null,null,null,null,null,null,null,null,null,null,null,null,null,null,null,null,null,null,null,null,null,null,null,"1.7","1.7"]
["Sim","Não",null,null,null,null,null,null,null,null,null,null,null,null,null,null,null,null,null,null,null,null,null,null,null,null,null,null,null,null,null,null,null,null,null,null,null,null,null,null,null,null,null,null,null,null,null,null,null,null,null,null,null,null,null,null,null,null,null,"2.1","2.1"]
["Sim","Sim",null,null,null,null,null,null,null,null,null,null,null,null,null,null,null,null,null,null,null,null,null,null,null,null,null,null,null,null,null,null,null,null,null,null,null,null,null,null,null,null,null,null,null,null,null,null,null,null,null,null,null,null,null,null,null,null,null,"2.2","2.2"]
[null,"Não",null,null,null,null,null,null,null,null,null,null,null,null,null,null,null,null,null,null,null,null,null,null,null,null,null,null,null,null,null,null,null,null,null,null,null,null,null,null,null,null,null,null,null,null,null,null,null,null,null,null,null,null,null,null,null,null,null,"2.3","2.3"]
[null,null,null,null,null,null,null,null,null,null,null,null,null,null,null,null,null,null,null,null,null,null,null,null,null,null,null,null,null,null,null,null,null,null,null,null,null,null,null,null,null,null,null,null,null,null,null,null,null,null,null,null,null,null,null,null,null,null,null,"2.4","2.4"]
[null,null,null,null,null,null,null,null,null,null,null,null,null,null,null,null,null,null,null,null,null,null,null,null,null,null,null,null,null,null,null,null,null,null,null,null,null,null,null,null,null,null,null,null,null,null,null,null,null,null,null,null,null,null,null,null,null,null,null,"2.5","2.5"]
[null,null,null,null,null,null,null,null,null,null,null,null,null,null,null,null,null,null,null,null,null,null,null,null,null,null,null,null,null,null,null,null,null,null,null,null,null,null,null,null,null,null,null,null,null,null,null,null,null,null,null,null,null,null,null,null,null,null,null,"2.6","2.6"]
["Não se aplica","Não se aplica",null,null,null,null,null,null,null,null,null,null,null,null,null,null,null,null,null,null,null,null,null,null,null,null,null,null,null,null,null,null,null,null,null,null,null,null,null,null,null,null,null,null,null,null,null,null,null,null,null,null,null,null,null,null,null,null,null,"3.1","3.1"]
["1.1 - Legislação","PDC 1 e 2",null,null,null,null,null,null,null,null,null,null,null,null,null,null,null,null,null,null,null,null,null,null,null,null,null,null,null,null,null,null,null,null,null,null,null,null,null,null,null,null,null,null,null,null,null,null,null,null,null,null,null,null,null,null,null,null,null,"3.2","3.2"]
["1.2 - Planejamento",null,null,null,null,null,null,null,null,null,null,null,null,null,null,null,null,null,null,null,null,null,null,null,null,null,null,null,null,null,null,null,null,null,null,null,null,null,null,null,null,null,null,null,null,null,null,null,null,null,null,null,null,null,null,null,null,null,null,"3.3","3.3"]
["2.1 - Plano",null,null,null,null,null,null,null,null,null,null,null,null,null,null,null,null,null,null,null,null,null,null,null,null,null,null,null,null,null,null,null,null,null,null,null,null,null,null,null,null,null,null,null,null,null,null,null,null,null,null,null,null,null,null,null,null,null,null,"3.4","3.4"]
["2.2 - Outorga",null,null,null,null,null,null,null,null,null,null,null,null,null,null,null,null,null,null,null,null,null,null,null,null,null,null,null,null,null,null,null,null,null,null,null,null,null,null,null,null,null,null,null,null,null,null,null,null,null,null,null,null,null,null,null,null,null,null,"3.5","3.5"]
["2.3 - Cobrança",null,null,null,null,null,null,null,null,null,null,null,null,null,null,null,null,null,null,null,null,null,null,null,null,null,null,null,null,null,null,null,null,null,null,null,null,null,null,null,null,null,null,null,null,null,null,null,null,null,null,null,null,null,null,null,null,null,null,"4.1","4.1"]
["2.4 - Enquadramento",null,null,null,null,null,null,null,null,null,null,null,null,null,null,null,null,null,null,null,null,null,null,null,null,null,null,null,null,null,null,null,null,null,null,null,null,null,null,null,null,null,null,null,null,null,null,null,null,null,null,null,null,null,null,null,null,null,null,"4.2","4.2"]
["2.6 - Integração",null,null,null,null,null,null,null,null,null,null,null,null,null,null,null,null,null,null,null,null,null,null,null,null,null,null,null,null,null,null,null,null,null,null,null,null,null,null,null,null,null,null,null,null,null,null,null,null,null,null,null,null,null,null,null,null,null,null,"5.1","5.1"]
["2.7 - CORHI",null,null,null,null,null,null,null,null,null,null,null,null,null,null,null,null,null,null,null,null,null,null,null,null,null,null,null,null,null,null,null,null,null,null,null,null,null,null,null,null,null,null,null,null,null,null,null,null,null,null,null,null,null,null,null,null,null,null,"5.2","5.2"]
["3.1 - Efluentes",null,null,null,null,null,null,null,null,null,null,null,null,null,null,null,null,null,null,null,null,null,null,null,null,null,null,null,null,null,null,null,null,null,null,null,null,null,null,null,null,null,null,null,null,null,null,null,null,null,null,null,null,null,null,null,null,null,null,"5.3","5.3"]
["3.2 - Poluição",null,null,null,null,null,null,null,null,null,null,null,null,null,null,null,null,null,null,null,null,null,null,null,null,null,null,null,null,null,null,null,null,null,null,null,null,null,null,null,null,null,null,null,null,null,null,null,null,null,null,null,null,null,null,null,null,null,null,"6.1","6.1"]
["3.3 - Resíduos",null,null,null,null,null,null,null,null,null,null,null,null,null,null,null,null,null,null,null,null,null,null,null,null,null,null,null,null,null,null,null,null,null,null,null,null,null,null,null,null,null,null,null,null,null,null,null,null,null,null,null,null,null,null,null,null,null,null,"6.2","6.2"]
["3.4 - Intervenções",null,null,null,null,null,null,null,null,null,null,null,null,null,null,null,null,null,null,null,null,null,null,null,null,null,null,null,null,null,null,null,null,null,null,null,null,null,null,null,null,null,null,null,null,null,null,null,null,null,null,null,null,null,null,null,null,null,null,"6.3","6.3"]
["4.1 - Erosão",null,null,null,null,null,null,null,null,null,null,null,null,null,null,null,null,null,null,null,null,null,null,null,null,null,null,null,null,null,null,null,null,null,null,null,null,null,null,null,null,null,null,null,null,null,null,null,null,null,null,null,null,null,null,null,null,null,null,"7.1","7.1"]
["4.2 - Conservação",null,null,null,null,null,null,null,null,null,null,null,null,null,null,null,null,null,null,null,null,null,null,null,null,null,null,null,null,null,null,null,null,null,null,null,null,null,null,null,null,null,null,null,null,null,null,null,null,null,null,null,null,null,null,null,null,null,null,"7.2","7.2"]
["4.3 - Mananciais",null,null,null,null,null,null,null,null,null,null,null,null,null,null,null,null,null,null,null,null,null,null,null,null,null,null,null,null,null,null,null,null,null,null,null,null,null,null,null,null,null,null,null,null,null,null,null,null,null,null,null,null,null,null,null,null,null,null,"7.3","7.3"]
["5.1 - Perdas",null,null,null,null,null,null,null,null,null,null,null,null,null,null,null,null,null,null,null,null,null,null,null,null,null,null,null,null,null,null,null,null,null,null,null,null,null,null,null,null,null,null,null,null,null,null,null,null,null,null,null,null,null,null,null,null,null,null,"8.1","8.1"]
["5.2 - Racionalização",null,null,null,null,null,null,null,null,null,null,null,null,null,null,null,null,null,null,null,null,null,null,null,null,null,null,null,null,null,null,null,null,null,null,null,null,null,null,null,null,null,null,null,null,null,null,null,null,null,null,null,null,null,null,null,null,null,null,"8.2","8.2"]
["5.3 - Reuso",null,null,null,null,null,null,null,null,null,null,null,null,null,null,null,null,null,null,null,null,null,null,null,null,null,null,null,null,null,null,null,null,null,null,null,null,null,null,null,null,null,null,null,null,null,null,null,null,null,null,null,null,null,null,null,null,null,null,"8.3","8.3"]
["6.1 - Captação"]
["6.2 - Regularização"]
["7.1 - Drenagem"]
["7.2 - Escassez"]
["8.1 - Capacitação"]
["8.2 - Educação"]
["8.3 - Comunicação"]

{"sheet":"Explicativo","index":11,"n_rows":39,"n_cols":2,"rows_kept":39,"cut":false,"hidden":true,"merged":[]}
["Explicativo","Função"]
["sheet PAPI_20_21"]
["Coluna A","PDCs da Delib. CRH 190/2016 = lista suspensa (Operacional)"]
["Coluna B","subPDCs da Delib. CRH 190/2016 = lista suspensa (Operacional)"]
["Coluna E","formatação condicional para % = % tem que coincidir com o informado pelo CBH na Coluna O (Execução)"]
["Coluna F","categorias de Executores de Empreendimentos Fehidro = lista suspensa (Operacional)"]
["Coluna G","Área de abrangencia = delimitações possível em mapeamento = lista suspensa (Operacional)"]
["Coluna H","Nome da área de abrangencia conforme consta no Empreendimento Fehidro ou TR ou similar (preenchimento livre)"]
["Coluna I","R$ total que consta no PAPI vigente aprovado pelo CBH no RS "]
["Coluna J","R$ total disponibilizado para investimento conforme Deliberação do COFEHIDRO"]
["Coluna K","R$ total efetivamente pago/repassado neste exercício (Coluna L) ao Executor da Ação = tem que coincidir com informações do SINFehidro\nQuando R$ de K é maior que R$ de I, valor é destacado em vermelho = CBH tem que explicar a extrapolação dos recursos"]
["Coluna L","ano/exercício ao qual se referem os dados informados"]
["Coluna M","categorias de Fontes de recursos para os Executores da Ação = lista suspensa (Operacional)"]
["Coluna N","Nome da Fonte de recursos conforme consta no Empreendimento Fehidro ou TR ou similar = tem que coincidir com informações do SinFEHIDRO"]
["Coluna O","Informações relevantes sobre a execução Física e Financeira da Ação = tem que coincidir com a execução do Empreendimento e informações do SinFEHIDRO"]
[]
["sheet PAPI_22_23"]
["Coluna A","PDCs da Delib. CRH 246/2021 = lista suspensa (Operacional)"]
["Coluna B","subPDCs da Delib. CRH 246/2021 = lista suspensa (Operacional)"]
["Coluna E","formatação condicional para % = % tem que coincidir com o informado pelo CBH na Coluna O (Execução)"]
["Coluna F","categorias de Executores de Empreendimentos Fehidro = lista suspensa (Operacional)"]
["Coluna G","Área de abrangencia = delimitações possível em mapeamento = lista suspensa (Operacional)"]
["Coluna H","Nome da área de abrangencia conforme consta no Empreendimento Fehidro ou TR ou similar (preenchimento livre)"]
["Coluna I","R$ total que consta no PAPI vigente aprovado pelo CBH no RS "]
["Coluna J","R$ total disponibilizado para investimento conforme Deliberação do COFEHIDRO"]
["Coluna K","R$ total efetivamente pago/repassado neste exercício (Coluna L) ao Executor da Ação = tem que coincidir com informações do SINFehidro\nQuando R$ de K é maior que R$ de I, valor é destacado em vermelho = CBH tem que explicar a extrapolação dos recursos"]
["Coluna L","ano/exercício ao qual se referem os dados informados"]
["Coluna M","categorias de Fontes de recursos para os Executores da Ação = lista suspensa (Operacional)"]
["Coluna N","Nome da Fonte de recursos conforme consta no Empreendimento Fehidro ou TR ou similar = tem que coincidir com informações do SinFEHIDRO"]
["Coluna O","Informações relevantes sobre a execução Física e Financeira da Ação = tem que coincidir com a execução do Empreendimento e informações do SinFEHIDRO"]
[]
["sheet Consolidação","DEVE SER BLOQUEADA PARA ALTERAÇÕES"]
[]
["Coluna A","PDCs da Delib. CRH 190/2016 = lista suspensa (Operacional)"]
["Colunas B C D","Cálculos com os valores de Recurso financeiro Executado 2020 (sheet PAPI_20_21; Coluna K) para cada fonte FEHIDRO e para outras (soma da demais fontes)"]
["Colunas E F G","Cálculos com os valores de Recurso financeiro Executado 2021 (sheet PAPI_20_21; Coluna K) para cada fonte FEHIDRO e para outras (soma da demais fontes)"]
["Coluna H","PDCs da Delib. CRH 246/2021 = lista suspensa (Operacional)"]
["Colunas H I J","Cálculos com os valores de Recurso financeiro Executado 2022 (sheet PAPI_22_23; Coluna K) para cada fonte FEHIDRO e para outras (soma da demais fontes)"]
["Colunas K L M","Cálculos com os valores de Recurso financeiro Executado 2023 (sheet PAPI_22_23; Coluna K) para cada fonte FEHIDRO e para outras (soma da demais fontes)"]

{"sheet":"de-para 246 190","index":12,"n_rows":33,"n_cols":14,"rows_kept":33,"cut":false,"hidden":true,"merged":[]}
["246","190","Coluna1",null,"246","190","Coluna1","Coluna12",null,"190","246",null,"190","246"]
["1.1","1.6",null,null,"1.1","1.6",null,null,null,"1.1","2.5",null,"1.1","2.5"]
["1.2","1.2",null,null,"1.2","1.2","1.5","1.7",null,"1.2","1.2",null,"1.2","1.2"]
["2.1","2.1",null,null,"2.1","2.1",null,null,null,"1.3","2.4",null,"1.3","2.4"]
["2.2","2.2",null,null,"2.2","2.2",null,null,null,"1.4","2.5",null,"1.4","2.5"]
["2.3","2.3",null,null,"2.3","2.3",null,null,null,"1.5","6.1",null,"1.5","1.2"]
["2.4","1.3",null,null,"2.4","1.3","2.4",null,null,"1.6","1.1",null,"1.6","1.1"]
["2.4","2.4",null,null,"2.5","1.1","1.4","7.1",null,"1.7","3.2",null,"1.7","1.2"]
["2.5","1.1","1.4",null,"2.6","2.5",null,null,null,"2.1","2.1",null,"2.1","2.1"]
["2.6","2.5",null,null,"2.7","2.6",null,null,null,"2.2","2.2",null,"2.2","2.2"]
["2.7","2.6",null,null,"3.1","3.1",null,null,null,"2.3","2.3",null,"2.3","2.3"]
["3.1","3.1",null,null,"3.2",null,null,null,null,"2.4","2.4",null,"2.4","2.4"]
["3.2","1.7",null,null,"3.3","3.2",null,null,null,"2.5","2.6",null,"2.5","2.6"]
["3.3","3.2",null,null,"3.4","3.5",null,null,null,"2.6","2.7",null,"2.6","2.7"]
["3.4","3.5",null,null,"4.1","3.4",null,null,null,"3.1","3.1",null,"3.1","3.1"]
["4.1","3.4",null,null,"4.2","4.2",null,null,null,"3.2","3.3",null,"3.2","3.3"]
["4.2","4.2",null,null,"4.3","4.1",null,null,null,"3.3","7.1",null,"3.4","4.1"]
["4.3","4.1",null,null,"5.1","5.1",null,null,null,"3.4","4.1",null,"3.5","3.4"]
["5.1","5.1",null,null,"5.2","5.2",null,null,null,"3.5","3.4",null,"4.1","4.3"]
["5.2","5.2",null,null,"5.3","5.3",null,null,null,"4.1","4.3",null,"4.2","4.2"]
["5.3","5.3",null,null,"6.1",null,null,null,null,"4.2","4.2",null,"5.1","5.1"]
["6.1","1.5","6.2",null,"6.2","6.2",null,null,null,"5.1","5.1",null,"5.2","5.2"]
["6.2","6.1","6.3",null,"7.1","7.2",null,null,null,"5.2","5.2",null,"5.3","5.3"]
["7.1","3.3","7.2",null,"7.2","7.3",null,null,null,"5.3","5.3",null,"6.2","6.2"]
["7.2","7.1","7.3",null,"8.1","8.1",null,null,null,"6.1","6.2",null,"7.1","2.5"]
["8.1","8.1",null,null,"8.2","8.2",null,null,null,"6.2","6.1",null,"7.2","7.1"]
["8.2","8.2",null,null,"8.3","8.3",null,null,null,"6.3","6.2",null,"7.3","7.2"]
["8.3","8.3",null,null,null,null,null,null,null,"7.1","7.2",null,"8.1","8.1"]
[null,null,null,null,null,null,null,null,null,"7.2","7.1",null,"8.2","8.2"]
[null,null,null,null,null,null,null,null,null,"7.3","7.2",null,"8.3","8.3"]
[null,null,null,null,null,null,null,null,null,"8.1","8.1"]
[null,null,null,null,null,null,null,null,null,"8.2","8.2"]
[null,null,null,null,null,null,null,null,null,"8.3","8.3"]